program: Gaussian 09
title: 000203084
version: EM64L-G09RevD.01
frameworkgroup: C1[X(C12H17N3O2)]
method: RPBEPBE
basis: SDD
operation: Freq
keyword: #p
keyword: freq=noraman
keyword: PBEPBE/SDD
title: #p freq=noraman PBEPBE/SDD
converged: YES YES NO NO
title: Mulliken charges:
elementType: O O N N N C C C C C C C C C C C C H H H H H H H H H H H H H H H H H
charge: -0.479757 -0.437700 -0.108573 -0.181115 -0.083299 -0.420790 -0.354347 -0.375051 0.315811 -0.020923 -0.219716 -0.290570 -0.318010 -0.356545 -0.305322 -0.222850 -0.233468 0.209374 0.306138 0.218460 0.213645 0.221256 0.221851 0.262818 0.192948 0.205021 0.213791 0.205981 0.231578 0.247537 0.221277 0.224836 0.356684 0.339032
chargesum: 0.00000
title: Mulliken charges with hydrogens summed into heavy atoms:
elementType: O O N N N C C C C C C C C C C C C
charge: -0.123073 -0.098669 -0.108573 -0.181115 -0.083299 0.094722 0.077758 0.068056 0.315811 -0.020923 0.043102 0.107399 0.101762 -0.124967 -0.057785 -0.001574 -0.008632
polarizability: 2.04431522e+02 1.91491112e+01 1.20551674e+02 -5.03830924e+00 -1.63037069e+01 1.39089187e+02
1716.lowfreq: -12.5257 -5.8018 -4.5883 -1.9696 -0.0008 -0.0005 -0.0003 18.0366 30.5459
frequency: -11.6784 17.8301 30.5220 45.1627 82.1772 89.6535 113.6747 143.0192 185.2390 218.4339 229.8254 260.4373 286.1585 301.7975 318.1701 329.2686 347.6779 399.2125 421.4255 443.2224 483.4330 505.3254 552.2855 577.6049 602.8407 630.2907 745.5760 750.4375 762.8278 767.9080 782.6326 811.0288 826.9023 854.0517 855.1229 860.1668 933.2228 935.1846 959.9173 975.1512 988.8823 1007.2183 1023.6022 1041.8703 1055.1992 1060.2228 1071.2660 1100.4707 1117.1684 1148.1895 1157.9066 1179.6091 1191.1655 1204.1020 1226.4446 1240.6390 1259.9961 1282.5824 1285.2540 1296.6954 1313.0222 1328.0666 1342.3858 1364.4185 1373.0778 1392.1445 1400.3989 1401.8399 1407.4444 1445.0810 1453.1398 1456.9075 1461.7747 1468.6886 1470.5541 1479.9784 1486.9140 1586.7514 1624.4982 2905.1237 2910.0050 2920.4446 2947.1355 2984.9819 3015.6914 3024.2904 3047.9637 3069.8029 3076.9815 3125.5534 3138.4016 3154.4312 3170.2928 3237.7937 3565.3476 3580.1434
redmass: 5.5222 5.2124 5.5665 2.9887 3.7426 2.3769 4.2697 3.8767 3.8831 4.0912 3.0955 2.8834 1.2343 3.4251 1.7432 1.4829 3.3654 2.7505 2.8231 3.5946 4.6658 2.3208 5.7543 3.9594 4.6375 4.1784 3.7881 1.4522 4.3530 3.6082 1.8681 1.6800 1.4281 2.3910 1.8000 5.3352 2.1811 1.3907 4.0152 1.3037 2.5434 2.0493 2.7764 1.8134 2.8015 2.4085 2.9822 1.6170 1.7970 1.8095 1.3026 1.4675 1.4979 1.3306 1.4331 1.8277 2.3185 1.3824 1.2737 1.2031 1.3782 3.9010 1.6734 1.2343 1.3476 1.4181 1.9936 1.5997 1.4058 2.2908 4.7626 1.0949 1.1188 1.1390 2.5953 1.0968 1.2234 6.9277 7.6729 1.0704 1.0694 1.0677 1.0571 1.0645 1.1056 1.0924 1.0895 1.0923 1.1016 1.0857 1.0902 1.0952 1.0991 1.0978 1.0663 1.0666
irintensity: 0.4955 0.5835 1.2398 0.3496 6.0065 4.0303 4.2563 2.0841 1.5634 8.2241 19.9563 11.5437 146.2337 4.7899 69.8486 66.6255 13.9673 23.4091 10.5076 2.0648 8.8427 9.8674 0.6705 2.7932 3.4124 1.1861 23.7214 88.3698 10.6803 3.0097 10.1860 8.5535 10.3309 4.3553 14.7307 5.0803 16.4157 3.6908 84.5409 0.5551 70.4333 12.5120 30.4614 29.6708 13.8163 26.9601 1.1685 85.7354 27.8973 30.1547 4.6938 11.7251 71.1574 23.6519 6.7672 15.9629 54.0352 2.8671 5.4045 34.1994 40.2357 2.8592 27.5362 18.0263 7.8622 6.8221 4.1665 1.7922 33.9790 72.8710 3.4346 8.0814 9.8451 4.6973 9.5964 7.6515 18.2437 2.7857 11.3908 41.5693 57.7842 92.4292 78.7146 50.5086 73.5835 11.7218 21.6437 3.4751 48.1895 1.9537 15.3092 24.8400 21.0917 0.3572 7.3812 6.1621
temp: 298.150 k
press: 1.00000 atm
elementType: 8 8 7 7 7 6 6 6 6 6 6 6 6 6 6 6 6 1 1 1 1 1 1 1 1 1 1 1 1 1 1 1 1 1
symmnumber: 1
zpe: 732741.3 jmol-1
zpe.correction: 0.279086 hartree
zpe.thermalcorrener: 0.295068 hartree
zpe.thermalcorrenthalpy: 0.296012 hartree
zpe.thermalcorrgfe: 0.233764 hartree
zpe.sumelectzpe: -780.849630 hartree
zpe.sumelectthermal: -780.833649 hartree
zpe.sumelectthermalent: -780.832705 hartree
zpe.sumelectthermalfe: -780.894952 hartree
dipole: -3.4798 -0.8862 -2.3207
dipole: 4.2755
quadrupole: -88.1421 -108.9163 -103.6672
quadrupole: 17.8408 -6.6258 -3.5853
quadrupole: 12.0998 -8.6744 -3.4253 17.8408 -6.6258 -3.5853
hfenergy: -781.1287166 hartree
pointgroup: C01 [X(C12H17N3O2)]
dipole: 1.3508234 -0.7645489 0.6483041 debye
polarizability: 201.8910045|-19.8508756|113.234716|-13.8412642|4.9020597|148.9466611 unknown
InChI: InChI=1S/C12H17N3O2/c16-7-5-14(6-8-17)10-15-9-13-11-3-1-2-4-12(11)15/h1-4,9,16-17H,5-8,10H2
charge 0 multiplicity 1
34 atoms
O  3.186365 -2.643017 -0.96246
O  2.095819 3.586257 0.924432
N  2.016557 -0.169195 0.344464
N  -0.251519 -0.774701 -0.295994
N  -1.508624 -0.209155 -2.132792
C  0.942349 -1.169203 0.472574
C  3.38731 -0.706947 0.497013
C  1.762407 1.115426 1.039236
C  -1.533884 -0.465293 0.196903
C  -2.30757 -0.117115 -0.96563
C  -0.30526 -0.599511 -1.685302
C  3.932311 -1.384196 -0.765037
C  2.232542 2.318238 0.192228
C  -2.085472 -0.455601 1.496959
C  -3.664846 0.252698 -0.827832
C  -3.441344 -0.080333 1.61157
C  -4.219898 0.268072 0.468291
H  0.606073 -1.318108 1.524672
H  1.333435 -2.125229 0.08879
H  3.47223 -1.424709 1.346881
H  4.058551 0.13977 0.730493
H  2.254904 1.165536 2.037687
H  0.672779 1.209418 1.211144
H  0.572299 -0.761666 -2.30706
H  5.013927 -1.598363 -0.625031
H  3.797271 -0.704822 -1.63127
H  1.679545 2.331925 -0.768909
H  3.311354 2.246096 -0.027327
H  -1.504859 -0.730509 2.384249
H  -4.25568 0.515664 -1.710669
H  -3.908209 -0.060223 2.602735
H  -5.269764 0.549656 0.604544
H  3.496918 -3.093813 -1.786174
H  1.133784 3.787557 1.04602
