program: Gaussian 09
title: 000203078
version: EM64L-G09RevD.01
frameworkgroup: C1[X(C12H13FN2)]
method: RPBEPBE
basis: SDD
operation: Freq
keyword: #p
keyword: freq=noraman
keyword: PBEPBE/SDD
title: #p freq=noraman PBEPBE/SDD
converged: NO YES NO NO
title: Mulliken charges:
elementType: F N N C C C C C C C C C C C C H H H H H H H H H H H H H
charge: -0.220663 -0.308880 -0.476404 -0.156291 0.217800 0.162469 -0.459915 -0.488311 0.161927 0.221320 -0.729978 -0.581785 -0.328208 0.325142 -0.378020 0.207404 0.211145 0.199960 0.204824 0.228495 0.271947 0.299305 0.223092 0.206313 0.245763 0.259733 0.233227 0.248591
chargesum: 0.00000
title: Mulliken charges with hydrogens summed into heavy atoms:
elementType: F N N C C C C C C C C C C C C
charge: -0.220663 -0.036934 -0.177099 0.051113 0.217800 0.162469 -0.048811 -0.054993 0.161927 0.221320 -0.054811 -0.322051 -0.094981 0.325142 -0.129429
polarizability: 1.97294875e+02 3.08919512e+00 1.46320597e+02 -2.31146457e+00 4.94591685e+00 7.87958029e+01
1716.lowfreq: -7.6842 -0.0002 0.0004 0.0008 7.0717 12.3745 66.1264 100.0144 132.4816
frequency: 66.0471 99.9773 132.4807 150.5066 203.1061 223.5123 238.4158 250.9445 330.1762 346.9789 364.5814 381.8482 426.4260 427.9932 468.2632 473.9663 494.2560 518.8745 591.0241 600.0016 608.4924 660.3599 688.1315 747.2029 763.2246 788.6286 791.4082 840.3326 859.1420 866.1901 909.3026 915.7230 956.7368 982.8457 1002.6218 1017.8607 1058.8008 1102.4720 1115.9266 1130.2443 1156.3795 1175.4656 1185.8513 1219.4337 1223.7852 1246.4497 1268.3206 1272.4386 1296.9475 1324.0952 1330.3977 1372.3268 1388.4408 1409.9701 1437.7608 1455.1551 1462.4575 1468.5885 1470.0799 1476.1945 1484.7385 1487.6339 1582.3174 1599.2390 1639.3377 2819.2166 2870.4152 2966.7394 2977.0242 2982.9727 3041.4713 3070.4968 3091.2489 3140.2563 3168.9853 3178.8662 3483.5259 3608.6988
redmass: 4.1526 3.5588 3.5545 4.3634 3.8223 1.1212 3.9110 2.5479 3.1517 5.2087 4.2694 3.9588 2.9301 4.3782 1.2846 2.2088 3.6462 3.3029 3.2233 3.2554 3.3148 4.8811 4.8682 3.5877 3.1249 1.5843 4.6430 3.7615 1.5452 2.9866 2.2036 1.3280 2.1332 1.9033 1.8697 1.9317 1.9093 2.2902 1.3932 2.1139 2.9299 2.2344 1.2834 1.7062 1.3245 1.6866 1.5506 1.3237 2.0916 1.9026 1.9785 1.3134 1.4675 3.6539 1.7389 2.1726 1.1206 1.1250 1.8175 1.3444 1.8544 2.1639 7.3634 6.9638 7.2179 1.0715 1.0707 1.0794 1.0396 1.0846 1.0902 1.0988 1.1002 1.0900 1.0928 1.0954 1.0757 1.0804
irintensity: 0.2552 1.0251 2.7256 0.5668 0.7156 0.3160 0.7362 2.3648 1.1339 0.1506 1.2224 8.1674 6.2889 6.1836 38.6798 111.4185 10.9872 13.2312 21.4010 20.7478 36.1594 2.1241 5.4752 4.0949 2.8054 53.8361 31.9837 3.0284 35.7763 12.1919 3.2735 0.2458 6.2458 6.2601 10.3165 8.8497 16.5327 2.6047 6.1164 67.6198 10.7339 11.7956 0.4851 25.5147 8.0663 3.7485 11.3364 2.7524 2.8501 29.3761 1.4244 18.4186 13.3090 56.4320 8.7830 39.4056 8.2199 1.4899 6.2007 8.4459 55.0109 12.5180 10.0708 37.4915 12.7198 123.2905 110.5982 40.2115 44.6161 38.0740 41.0022 55.3347 19.4052 10.8962 2.1034 4.6884 0.4653 49.6987
temp: 298.150 k
press: 1.00000 atm
elementType: 9 7 7 6 6 6 6 6 6 6 6 6 6 6 6 1 1 1 1 1 1 1 1 1 1 1 1 1
symmnumber: 1
zpe: 594716.0 jmol-1
zpe.correction: 0.226515 hartree
zpe.thermalcorrener: 0.239049 hartree
zpe.thermalcorrenthalpy: 0.239993 hartree
zpe.thermalcorrgfe: 0.188318 hartree
zpe.sumelectzpe: -673.339595 hartree
zpe.sumelectthermal: -673.327062 hartree
zpe.sumelectthermalent: -673.326118 hartree
zpe.sumelectthermalfe: -673.377792 hartree
dipole: 4.1139 3.5708 -0.5569
dipole: 5.4759
quadrupole: -87.1411 -74.9839 -92.3124
quadrupole: -4.4315 -4.0620 2.6350
quadrupole: -2.3286 9.8285 -7.4999 -4.4315 -4.0620 2.6350
hfenergy: -673.5661105 hartree
pointgroup: C01 [X(C12H13F1N2)]
dipole: -1.6148233 1.4055585 0.2409828 debye
polarizability: 197.2692678|-3.1830931|146.4511623|-2.6347259|-4.0593019|78.6908452 unknown
InChI: InChI=1S/C12H13FN2/c1-7-5-14-6-11-12(7)9-4-8(13)2-3-10(9)15-11/h2-4,7,14-15H,5-6H2,1H3
charge 0 multiplicity 1
28 atoms
F  4.010653 -1.580612 0.150707
N  -3.589456 0.221052 -0.132031
N  -0.263819 1.963978 -0.109835
C  -1.765599 -1.430131 0.290233
C  -0.849334 -0.234459 0.136454
C  -1.335397 1.065438 0.010317
C  -3.159179 -0.901606 0.737839
C  -2.788599 1.456024 0.02377
C  0.596344 -0.15101 0.08496
C  0.939932 1.244091 -0.068168
C  -1.864233 -2.262825 -1.015125
C  1.637219 -1.115086 0.161059
C  2.275499 1.689663 -0.14915
C  2.950723 -0.640177 0.078352
C  3.300922 0.723428 -0.07442
H  -1.380781 -2.085894 1.099417
H  -3.910223 -1.707757 0.650685
H  -3.098989 -0.603806 1.814312
H  -3.011385 2.012331 0.972784
H  -3.022842 2.141557 -0.815793
H  -4.598537 0.399703 -0.089885
H  -0.345323 2.970798 -0.231265
H  -0.862779 -2.538886 -1.39122
H  -2.437904 -3.194087 -0.846956
H  -2.375139 -1.668765 -1.79277
H  1.440594 -2.184262 0.279769
H  2.524263 2.749745 -0.266168
H  4.356272 1.003856 -0.13127
