program: Gaussian 09
title: 000203096
version: EM64L-G09RevD.01
frameworkgroup: C1[X(C19H20ClN3O)]
method: RPBEPBE
basis: SDD
operation: Freq
keyword: #p
keyword: freq=noraman
keyword: PBEPBE/SDD
title: #p freq=noraman PBEPBE/SDD
converged: YES YES NO NO
title: Mulliken charges:
elementType: Cl O N N N C C C C C C C C C C C C C C C C C C C H H H H H H H H H H H H H H H H H H H H
charge: -0.058507 -0.273716 -0.222307 -0.004443 -0.083911 -0.354371 0.054703 0.234260 -0.357309 0.150453 -0.664476 0.111164 0.528638 -0.358980 -0.366392 -0.244259 -0.224076 -0.617729 -0.614085 -0.368646 -0.442368 -0.205799 -0.207061 -0.118628 0.242799 0.249431 0.209837 0.228426 0.222397 0.257445 0.252310 0.279233 0.234299 0.238287 0.223047 0.228194 0.189442 0.193439 0.231360 0.222126 0.255195 0.239297 0.255714 0.255566
chargesum: 0.00000
title: Mulliken charges with hydrogens summed into heavy atoms:
elementType: Cl O N N N C C C C C C C C C C C C C C C C C C C
charge: -0.058507 -0.273716 -0.222307 -0.004443 -0.083911 0.137859 0.054703 0.234260 0.080954 0.150453 -0.184634 0.111164 0.528638 -0.106670 -0.087159 -0.009960 0.014211 0.022954 0.032840 -0.113451 -0.203071 0.049914 0.048505 -0.118628
polarizability: 3.22769300e+02 -1.73045864e+01 2.31003040e+02 -2.06090717e+01 1.30317226e+00 1.80350904e+02
1716.lowfreq: -6.5678 -4.6090 -0.0017 0.0003 0.0005 5.4208 11.0835 18.9444 31.0940
frequency: 10.0176 18.8995 31.0065 35.1594 36.7975 43.0975 84.0560 96.4931 110.3826 126.7994 175.0356 180.2435 213.6707 223.5922 238.5397 243.5262 259.8976 278.6892 296.8428 331.6043 336.3048 353.0672 369.8325 406.1609 409.9483 415.1940 419.3786 436.3547 472.1422 477.7099 481.6080 519.7662 547.1287 600.2127 611.4290 626.3630 663.9665 674.0477 684.1202 711.1199 739.7581 772.1355 785.5997 788.0177 796.8192 816.1140 830.1294 832.9784 838.6248 894.1113 912.7135 948.6509 965.7723 973.6637 978.0676 1000.5792 1009.8264 1021.9909 1025.0061 1031.3171 1038.0994 1060.6730 1069.3521 1073.1244 1091.4795 1101.6098 1107.6199 1121.1896 1144.7477 1175.7929 1184.2192 1188.7358 1198.3635 1202.3094 1221.1622 1267.6199 1271.0848 1279.8143 1288.4826 1297.1632 1313.5056 1314.6003 1333.2842 1347.2069 1377.1618 1377.7677 1397.5283 1401.1666 1423.3717 1433.0283 1441.6536 1447.1290 1456.1518 1462.7609 1469.3937 1476.6347 1476.9415 1478.6717 1482.4702 1486.9935 1516.5621 1564.1949 1587.6321 1600.0897 1601.2347 1616.9210 2853.9176 2864.8004 2879.1370 2992.9607 3018.6272 3029.7848 3037.9368 3048.7357 3054.1383 3077.7116 3089.6027 3121.9878 3126.7900 3135.6744 3138.2578 3150.2960 3163.7140 3167.1334 3170.5358 3172.9939
redmass: 5.5351 4.3948 7.5525 4.2889 2.9891 4.7127 3.8689 3.1183 5.9056 4.7219 6.0663 3.3826 3.7430 1.1320 1.8923 3.1721 2.6279 3.1708 5.4231 4.3216 3.1168 2.5699 4.3335 3.8349 2.9389 2.9078 3.1511 3.7971 4.7438 3.4001 6.3386 4.6300 4.7128 5.2028 5.1459 6.9929 4.8968 4.8051 4.1476 4.5133 5.0122 2.5753 1.5877 2.0754 2.2556 3.2650 3.5041 1.3851 1.7092 1.5481 2.6284 1.7197 2.1588 1.4502 1.3860 4.2682 1.3462 2.6895 2.7688 2.3471 1.6034 2.6841 2.7717 2.5903 1.2933 1.8724 1.3957 2.0416 1.6537 1.1051 1.1275 1.2880 1.9605 2.6767 2.6518 2.2788 2.2566 1.5917 1.5257 1.8079 1.6346 1.3102 1.4553 3.4660 1.3346 6.1272 4.0273 4.2616 1.1404 2.3195 1.1477 1.1535 1.1428 1.0498 1.0577 1.3843 1.7023 2.2993 1.0928 1.0542 6.0768 7.6860 7.3617 7.4643 7.4474 6.5137 1.0572 1.0606 1.0651 1.0600 1.0729 1.0743 1.0891 1.1003 1.0580 1.1009 1.1002 1.0900 1.1064 1.0861 1.0895 1.0898 1.0947 1.0950 1.0962 1.1001
irintensity: 0.1092 0.1393 0.3550 0.2815 0.5242 2.5668 1.2436 0.4635 0.9155 0.6021 0.5005 0.6601 0.7033 0.6552 0.1495 0.9817 4.3159 1.5070 0.4958 9.9944 6.2821 3.3368 14.7032 10.9592 0.4012 1.9454 0.4098 2.3290 11.7094 9.2884 1.8682 1.7758 23.1865 6.5482 1.9762 0.7756 21.7325 9.4423 24.4767 16.0059 38.9031 17.0547 16.8068 18.9381 39.9281 4.9307 13.2924 6.5549 27.6303 0.3628 2.4920 3.0382 5.0377 1.4667 2.8963 45.3245 0.5603 57.6567 2.6407 10.8993 24.6455 51.9399 35.8234 17.5335 2.5016 17.1794 16.6963 10.6816 8.4718 4.1600 0.3372 9.2129 5.5337 0.2617 24.4319 30.8010 13.9496 2.0017 13.3527 24.9667 5.8284 9.1750 8.6244 5.6484 14.0055 0.9908 16.5766 19.4066 2.6188 3.3232 3.1979 16.6797 27.2235 17.3438 9.2198 36.3900 34.3714 55.7268 18.5826 10.8336 9.7356 92.8731 8.8159 107.8178 78.9586 3.8412 92.7001 92.2906 151.8318 18.2350 44.5330 45.3088 11.6214 5.6826 23.3877 34.4238 47.8653 11.7884 4.1093 2.5102 4.6985 8.9704 9.0111 6.0279 0.6275 21.5852
temp: 298.150 k
press: 1.00000 atm
elementType: 17 8 7 7 7 6 6 6 6 6 6 6 6 6 6 6 6 6 6 6 6 6 6 6 1 1 1 1 1 1 1 1 1 1 1 1 1 1 1 1 1 1 1 1
symmnumber: 1
zpe: 919769.9 jmol-1
zpe.correction: 0.350322 hartree
zpe.thermalcorrener: 0.372642 hartree
zpe.thermalcorrenthalpy: 0.373586 hartree
zpe.thermalcorrgfe: 0.294734 hartree
zpe.sumelectzpe: -1433.819125 hartree
zpe.sumelectthermal: -1433.796805 hartree
zpe.sumelectthermalent: -1433.795861 hartree
zpe.sumelectthermalfe: -1433.874713 hartree
dipole: -0.2228 0.9362 3.1655
dipole: 3.3086
quadrupole: -156.4465 -143.6621 -144.2326
quadrupole: -14.3226 -3.0475 2.8061
quadrupole: -8.3328 4.4516 3.8812 -14.3226 -3.0475 2.8061
hfenergy: -1434.1694469 hartree
pointgroup: C01[X(C19H20Cl1N3O1)]
dipole: 0.1891646 -0.6521363 -1.110568 debye
polarizability: 283.72359|51.7167391|268.9565139|12.6521186|-6.8171234|181.4431397 unknown
InChI: InChI=1S/C19H20ClN3O/c1-22(2)11-12-23-19(24)17-6-4-3-5-16(17)18(21-23)13-14-7-9-15(20)10-8-14/h3-10H,11-13H2,1-2H3
charge 0 multiplicity 1
44 atoms
Cl -6.772861 -1.553417 1.264799
O  3.153141 0.304371 1.737855
N  1.421303 1.093178 0.370804
N  0.315927 0.935222 -0.453092
N  3.301699 4.246934 -0.610866
C  1.909944 2.48601 0.473479
C  -0.188065 -0.291125 -0.627192
C  0.386315 -1.470713 0.012201
C  2.801715 2.861256 -0.734771
C  1.542003 -1.292119 0.839376
C  -1.399961 -0.358273 -1.542322
C  2.122481 0.05307 1.037123
C  -2.718184 -0.676217 -0.831775
C  -0.141228 -2.785306 -0.15378
C  2.149353 -2.403981 1.476178
C  0.46813 -3.879352 0.481728
C  1.616832 -3.691559 1.299773
C  3.593079 4.876514 -1.914525
C  4.437055 4.372576 0.327519
C  -3.073191 -0.007466 0.36718
C  -3.628812 -1.613687 -1.379105
C  -4.302554 -0.267071 1.010865
C  -4.866361 -1.886394 -0.752046
C  -5.181991 -1.206853 0.438957
H  1.038123 3.157402 0.506459
H  2.476355 2.558319 1.414698
H  3.630361 2.115192 -0.824148
H  2.185809 2.786924 -1.649887
H  -1.227856 -1.101404 -2.344436
H  -1.477522 0.630666 -2.031165
H  -1.033126 -2.939668 -0.767868
H  3.031649 -2.221555 2.097888
H  0.054126 -4.88501 0.350211
H  2.082434 -4.551967 1.79193
H  3.857889 5.938327 -1.760029
H  2.695371 4.839993 -2.556709
H  4.43719 4.391087 -2.46757
H  5.359306 3.850961 -0.033447
H  4.175163 3.948236 1.311305
H  4.679179 5.440447 0.473709
H  -2.384297 0.724896 0.802705
H  -3.378745 -2.13678 -2.310558
H  -4.571344 0.250914 1.936073
H  -5.565835 -2.610076 -1.180425
