program: Gaussian 09
title: 000203060
version: EM64L-G09RevD.01
frameworkgroup: C1[X(C12H19NO3)]
method: RPBEPBE
basis: SDD
operation: Freq
keyword: #p
keyword: freq=noraman
keyword: PBEPBE/SDD
title: #p freq=noraman PBEPBE/SDD
converged: YES YES NO NO
title: Mulliken charges:
elementType: O O O N C C C C C C C C C C C C H H H H H H H H H H H H H H H H H H H
charge: -0.462437 -0.494424 -0.433941 -0.411278 -0.116959 -0.222575 -0.056493 0.571977 -0.748176 -0.693152 -0.672402 -0.603531 -0.396835 0.182524 -0.314917 0.129258 0.247719 0.179069 0.263110 0.224429 0.249358 0.205269 0.234619 0.214827 0.200022 0.234945 0.224330 0.215624 0.202209 0.225701 0.263710 0.361483 0.246731 0.369415 0.380793
chargesum: 0.00000
title: Mulliken charges with hydrogens summed into heavy atoms:
elementType: O O O N C C C C C C C C C C C C
charge: -0.100954 -0.125009 -0.053148 -0.148169 0.130760 -0.043506 0.167935 0.571977 -0.058930 -0.043358 -0.030239 -0.377831 -0.133125 0.182524 -0.068185 0.129258
polarizability: 2.03811974e+02 6.46633685e+00 1.41602371e+02 1.13210391e+01 -1.03635346e+01 1.07802514e+02
1716.lowfreq: -4.8733 -0.0007 -0.0006 -0.0005 3.6718 12.1869 28.3979 29.6690 47.7859
frequency: 27.7704 29.5419 47.6529 70.9997 89.6830 154.5617 176.2786 193.0055 213.9973 220.0742 233.4860 238.9696 245.7931 270.5829 279.9142 304.4992 308.2051 353.9761 385.9897 405.6715 433.0596 441.5296 461.5408 479.2872 487.5529 530.2928 571.4426 609.7967 616.7507 663.6235 715.5512 755.4017 772.7791 821.0967 830.9632 834.4373 845.6894 870.3682 885.5905 914.3438 925.9593 939.4331 952.9171 975.7016 1026.3073 1064.3126 1070.1550 1080.8932 1124.7729 1129.2387 1142.6065 1155.9696 1171.2421 1176.7792 1182.7353 1224.2435 1245.9881 1274.1715 1283.5537 1299.6868 1311.5297 1324.6129 1338.5472 1357.8257 1376.8889 1384.4712 1393.8092 1407.7983 1414.5946 1433.7662 1436.1325 1462.9930 1464.2166 1470.8752 1478.0202 1482.8790 1487.0081 1519.6523 1616.4218 1624.8535 2893.9777 2971.1125 2972.5500 2976.5893 2991.2435 3008.4409 3065.2824 3065.9721 3074.7553 3076.6564 3085.0960 3090.5947 3095.3070 3103.0626 3152.4614 3173.2862 3427.7977 3527.2780 3623.0050
redmass: 3.8857 4.4087 3.0717 4.0047 3.9405 4.5452 5.8233 2.7868 1.0866 2.1243 1.8655 1.4709 1.1611 1.5736 3.3663 5.1254 3.0474 2.9060 3.5124 2.7822 2.9046 2.8561 2.7251 1.4027 1.9594 3.5741 5.8916 5.5159 4.0594 2.1030 3.5043 5.8303 3.8579 1.6396 1.7443 1.4846 1.3366 1.5898 1.7776 1.2317 3.5579 1.4004 1.3388 1.9660 4.6608 2.1878 2.3629 2.3554 1.3921 2.0899 2.2281 1.4561 2.0540 1.5454 1.7057 2.6280 1.4651 1.6372 1.4339 1.3647 1.3700 1.3436 1.3778 1.2476 1.2282 1.2267 1.2261 1.6084 4.1651 2.3598 1.3327 1.0496 1.0514 1.0529 1.0489 1.0702 1.0490 3.2749 6.5756 7.1857 1.0831 1.0359 1.0378 1.0394 1.0828 1.0849 1.0987 1.0969 1.0979 1.0991 1.0951 1.0832 1.0828 1.0909 1.0878 1.0967 1.0741 1.0648 1.0666
irintensity: 0.6292 0.8226 0.2756 1.4709 1.4792 0.9441 3.9711 0.4128 0.3309 2.2538 67.1594 98.3434 2.9358 2.1499 7.5640 7.4389 5.7972 8.2274 2.0859 18.5454 7.1179 11.3526 1.7193 93.4235 34.2700 0.6689 28.4986 5.9654 12.0979 34.2489 0.8301 25.8801 6.6297 11.6246 5.9211 9.9794 180.0332 31.7820 15.6684 4.6084 33.2109 1.4696 0.2945 6.0793 54.6004 31.3314 116.7313 11.7627 66.0874 30.8847 48.7899 16.3030 79.0192 125.5985 87.7861 93.8570 20.3742 79.2718 11.9682 32.5777 2.6879 12.7669 57.0663 0.6905 22.9052 25.5877 25.4371 84.4374 17.0407 34.7443 64.4138 2.6989 7.3423 4.2435 3.9857 8.9929 18.8765 87.3945 18.7661 12.2580 66.1151 18.9666 28.1542 27.0945 8.1356 14.8290 4.4606 32.4408 77.2594 38.2530 7.0072 295.5094 83.4741 15.6326 3.4374 5.7038 0.0438 83.1730 44.7755
temp: 298.150 k
press: 1.00000 atm
elementType: 8 8 8 7 6 6 6 6 6 6 6 6 6 6 6 6 1 1 1 1 1 1 1 1 1 1 1 1 1 1 1 1 1 1 1
symmnumber: 1
zpe: 768001.2 jmol-1
zpe.correction: 0.292516 hartree
zpe.thermalcorrener: 0.310046 hartree
zpe.thermalcorrenthalpy: 0.310990 hartree
zpe.thermalcorrgfe: 0.246857 hartree
zpe.sumelectzpe: -747.835786 hartree
zpe.sumelectthermal: -747.818257 hartree
zpe.sumelectthermalent: -747.817313 hartree
zpe.sumelectthermalfe: -747.881446 hartree
dipole: -3.2739 4.5199 1.1058
dipole: 5.6895
quadrupole: -88.4905 -90.4342 -104.5111
quadrupole: 10.0572 -6.0477 -7.2441
quadrupole: 5.9881 4.0444 -10.0325 10.0572 -6.0477 -7.2441
hfenergy: -748.1283026 hartree
pointgroup: C01 [X(C12H19N1O3)]
dipole: -1.4371185 1.511788 0.8122435 debye
polarizability: 200.3905357|5.4202075|144.8950544|21.2146959|1.9637437|107.9312698 unknown
InChI: InChI=1S/C12H19NO3/c1-7(2)13-8(3)12(16)9-4-5-10(14)11(15)6-9/h4-8,12-16H,1-3H3
charge 0 multiplicity 1
35 atoms
O  -0.979431 -0.465704 -1.987298
O  4.065991 1.558276 0.808738
O  4.582911 -1.069516 1.178029
N  -2.977505 0.23386 -0.4776
C  -1.658971 0.450363 0.186528
C  -0.549802 0.461584 -0.949819
C  -3.880124 -0.821246 0.073586
C  0.819368 0.063475 -0.422907
C  -1.595925 1.725574 1.048448
C  -5.072217 -1.003701 -0.888029
C  -4.364365 -0.540249 1.519811
C  1.781129 1.051158 -0.090925
C  1.140535 -1.302022 -0.222838
C  3.025103 0.66717 0.441907
C  2.390792 -1.68425 0.30992
C  3.338534 -0.700379 0.65222
H  -1.460641 -0.437773 0.817105
H  -0.499928 1.499632 -1.357274
H  -3.484749 1.116189 -0.63853
H  -3.288708 -1.758382 0.08052
H  -0.585789 1.856451 1.476343
H  -1.822254 2.621434 0.436853
H  -2.320151 1.686006 1.88087
H  -5.733588 -1.817537 -0.541294
H  -5.679854 -0.078876 -0.942608
H  -4.721363 -1.245799 -1.906485
H  -3.512644 -0.426209 2.214548
H  -4.99063 -1.373345 1.889558
H  -4.969954 0.385725 1.557493
H  1.559395 2.113288 -0.265759
H  0.41455 -2.060143 -0.531608
H  -1.992939 -0.412583 -1.89189
H  2.65357 -2.736178 0.456742
H  3.841748 2.493658 0.58959
H  5.116603 -0.24655 1.335257
