program: Gaussian 09
title: 000203064
version: EM64L-G09RevD.01
frameworkgroup: C1[X(C15H25N3O)]
method: RPBEPBE
basis: SDD
operation: Freq
keyword: #p
keyword: freq=noraman
keyword: PBEPBE/SDD
title: #p freq=noraman PBEPBE/SDD
converged: YES YES NO NO
title: Mulliken charges:
elementType: O N N N C C C C C C C C C C C C C C C H H H H H H H H H H H H H H H H H H H H H H H H H
charge: -0.355136 -0.712206 -0.677855 -0.409360 -0.367261 -0.373217 -0.368945 -0.352367 -0.428719 -0.356238 -0.288006 -0.695985 0.295849 0.169719 -0.322790 -0.567998 0.559217 -0.459337 0.067803 0.186921 0.191584 0.190326 0.191770 0.212361 0.192063 0.187713 0.187246 0.214820 0.196788 0.195731 0.195387 0.216425 0.203596 0.209501 0.209633 0.216061 0.243247 0.294971 0.215467 0.299457 0.310089 0.381124 0.295166 0.205385
chargesum: 0.00000
title: Mulliken charges with hydrogens summed into heavy atoms:
elementType: O N N N C C C C C C C C C C C C C C C
charge: -0.355136 -0.102661 -0.001565 -0.203974 0.011244 0.008879 0.035479 0.022592 -0.017111 0.034880 0.132015 -0.060789 0.295849 0.169719 -0.079543 -0.273027 0.559217 -0.243870 0.067803
polarizability: 2.58852729e+02 -2.50861736e-01 2.02476614e+02 2.81644321e+01 -5.16801443e+00 1.27553676e+02
1716.lowfreq: -7.9476 -0.0008 0.0004 0.0010 2.6120 7.2008 15.3888 17.5018 29.5240
frequency: 15.3142 17.3805 29.4897 48.2622 53.7070 65.1670 84.4003 102.3767 113.2946 127.2546 136.2489 144.2805 176.2757 199.1227 216.1764 229.0210 241.3552 305.6473 308.4331 340.1722 355.4406 359.6496 362.2010 377.4718 400.0432 422.6519 454.0356 459.3326 464.2094 521.1523 550.4397 565.6889 617.8955 654.4182 673.2942 705.3210 719.6064 722.1037 737.1864 747.0178 769.3875 792.8957 796.2713 821.5108 880.2119 890.7784 900.2170 912.6973 920.4335 945.8510 947.8133 994.6546 1003.4127 1028.0236 1034.2998 1056.9767 1063.6422 1069.7260 1080.6502 1084.6202 1090.5312 1102.8890 1123.1600 1143.3272 1163.4032 1188.5862 1195.4108 1208.5966 1229.2748 1244.6276 1262.8636 1269.7774 1278.7680 1280.6252 1290.4575 1294.4662 1318.4474 1320.4190 1348.7765 1356.1427 1361.4178 1366.4731 1374.9846 1388.4333 1398.6494 1452.3596 1455.9935 1462.3156 1463.0727 1469.4386 1475.3515 1476.6103 1476.8998 1484.3028 1488.6166 1495.6677 1580.5288 1592.8992 1612.3105 1633.2400 1646.4586 2948.9596 2949.4168 2950.7655 2957.6192 2965.6343 2968.6727 2971.7667 2976.5168 2984.5745 2994.0918 3009.0567 3012.4792 3022.5689 3034.7491 3049.5155 3068.2816 3070.6778 3123.9674 3134.2239 3168.0042 3330.6401 3435.3227 3573.2138 3646.2990 3714.9567
redmass: 4.5905 4.7495 1.6451 3.6793 3.5713 5.0719 2.0561 2.8662 2.6226 3.3743 2.5055 2.7594 4.3813 3.4187 2.7302 1.1207 3.0145 2.7097 1.2299 4.1787 2.5266 1.4460 3.3412 3.6974 4.6962 1.9227 1.4191 2.8980 4.0681 3.4147 3.1225 3.1145 4.1685 1.0861 3.4292 5.4528 1.2085 1.2148 1.4214 4.5837 1.4907 1.3189 1.5284 1.4694 1.7549 1.6413 1.9124 1.5458 3.6245 1.4712 1.7083 2.7323 1.4566 3.2778 1.5098 2.2793 2.8461 2.6209 2.0514 1.4461 2.0666 1.5619 2.6514 1.7149 1.3810 1.6400 2.5311 1.2590 1.3537 1.2819 1.5621 1.2721 1.0880 1.1632 1.0726 1.1499 1.3734 2.7235 1.5020 1.6774 1.8289 1.5985 1.9798 1.2181 5.7069 1.0869 4.1770 1.0727 1.0698 1.0770 1.2504 1.0467 1.0713 1.0843 1.0943 2.2886 6.3378 5.2323 1.2231 1.5017 2.8734 1.0558 1.0584 1.0589 1.0595 1.0617 1.0592 1.0367 1.0632 1.0960 1.0985 1.1016 1.1034 1.1020 1.1043 1.1033 1.1006 1.0993 1.0894 1.0914 1.0929 1.0758 1.0530 1.0447 1.0978 1.1042
irintensity: 0.0818 0.2024 0.0160 0.5855 0.1343 5.7614 1.1607 1.4664 0.1882 1.5160 0.4747 1.1586 9.9649 1.6854 5.7971 0.0774 10.9791 18.0789 240.4358 4.3726 1.0204 24.4915 27.2827 5.5946 0.2448 73.8508 49.8631 0.1608 2.2441 5.1742 19.8009 19.4063 0.1156 177.9875 0.8088 5.3145 18.8216 6.9656 10.1596 0.7270 10.4266 79.9215 29.5905 10.5399 1.7133 16.7796 8.1363 4.3191 8.5541 25.7216 42.4305 23.1079 3.5096 7.3379 11.6515 8.0427 53.1928 37.1048 11.7716 102.5494 6.2436 4.9580 7.6430 1.5500 60.5023 0.2117 195.5877 6.4072 1.6293 1.2678 4.6201 0.9278 0.5253 0.9739 2.4650 1.1851 0.1182 4.7808 0.8131 0.6693 34.8458 4.6710 14.4907 11.1545 56.1650 13.8538 105.3608 0.1350 0.1510 0.9655 112.8415 10.7646 3.1035 1.3779 27.5050 150.3069 149.7195 116.7620 154.9869 51.8504 146.5733 31.4544 10.4329 1.7751 18.9487 2.6381 126.7055 35.2575 58.7938 2.4442 1.9106 17.3266 33.0311 15.2427 35.6707 140.1219 95.8782 53.9994 24.3514 14.1951 17.0432 28.0256 161.0190 69.5872 47.6557 19.7975
temp: 298.150 k
press: 1.00000 atm
elementType: 8 7 7 7 6 6 6 6 6 6 6 6 6 6 6 6 6 6 6 1 1 1 1 1 1 1 1 1 1 1 1 1 1 1 1 1 1 1 1 1 1 1 1 1
symmnumber: 1
zpe: 997357.5 jmol-1
zpe.correction: 0.379873 hartree
zpe.thermalcorrener: 0.401616 hartree
zpe.thermalcorrenthalpy: 0.402560 hartree
zpe.thermalcorrgfe: 0.326178 hartree
zpe.sumelectzpe: -824.591225 hartree
zpe.sumelectthermal: -824.569482 hartree
zpe.sumelectthermalent: -824.568538 hartree
zpe.sumelectthermalfe: -824.644920 hartree
dipole: -1.5900 -3.0681 -0.0378
dipole: 3.4558
quadrupole: -103.7059 -109.5750 -119.3592
quadrupole: -11.8317 8.9791 -3.2729
quadrupole: 7.1741 1.3050 -8.4791 -11.8317 8.9791 -3.2729
hfenergy: -824.971098 hartree
pointgroup: C01 [X(C15H25N3O1)]
dipole: 0.6014934 -1.2010096 0.2105969 debye
polarizability: 256.7708173|3.7308981|202.285706|32.4525133|-5.9841025|129.8264957 unknown
InChI: InChI=1S/C15H25N3O/c1-2-3-4-5-6-7-10-19-14-9-8-12(16)11-13(14)15(17)18/h8-9,11,17H,2-7,10,16,18H2,1H3
charge 0 multiplicity 1
44 atoms
O  -0.885805 -0.469463 0.696007
N  -6.174054 -0.053665 -1.325044
N  -0.781898 2.175848 0.682083
N  -2.724714 3.333859 -0.165168
C  3.522108 -0.799699 0.796375
C  4.455275 -0.195664 -0.277055
C  2.069545 -0.986522 0.304459
C  5.91161 -0.017015 0.208077
C  1.146728 -1.599203 1.381552
C  6.843897 0.589127 -0.865711
C  -0.299291 -1.801579 0.919564
C  8.298345 0.758588 -0.375895
C  -2.21349 -0.385511 0.191614
C  -2.768989 0.907637 -0.065843
C  -2.987516 -1.543355 -0.05623
C  -4.088274 0.977953 -0.569442
C  -4.872556 -0.174532 -0.824855
C  -4.299699 -1.447817 -0.557753
C  -2.068697 2.227961 0.153463
H  3.928779 -1.779586 1.124873
H  3.525887 -0.146345 1.694231
H  4.44631 -0.845518 -1.177133
H  4.053309 0.787021 -0.601363
H  1.658559 -0.011565 -0.023806
H  2.066754 -1.640735 -0.592358
H  5.92313 0.631584 1.109263
H  6.315421 -1.000357 0.528967
H  1.147794 -0.964855 2.290173
H  1.542824 -2.589435 1.687306
H  6.442031 1.573129 -1.18303
H  6.8287 -0.057052 -1.76722
H  -0.893712 -2.335863 1.689115
H  -0.333271 -2.381081 -0.026738
H  8.734035 -0.21561 -0.083495
H  8.344459 1.423924 0.507076
H  8.942915 1.194678 -1.16119
H  -2.57694 -2.537405 0.139872
H  -4.471797 1.987988 -0.753999
H  -4.87648 -2.362675 -0.74049
H  -6.740555 -0.874123 -1.514199
H  -6.5700 0.862343 -1.511086
H  -0.364321 1.26464 0.892594
H  -0.273144 3.03975 0.85458
H  -2.17321 4.196399 0.019165
