program: Gaussian 09
title: 000203080
version: EM64L-G09RevD.01
frameworkgroup: C1[X(C18H32N2)]
method: RPBEPBE
basis: SDD
operation: Freq
keyword: #p
keyword: freq=noraman
keyword: PBEPBE/SDD
title: #p freq=noraman PBEPBE/SDD
converged: NO YES NO NO
title: Mulliken charges:
elementType: N N C C C C C C C C C C C C C C C C C C H H H H H H H H H H H H H H H H H H H H H H H H H H H H H H H H
charge: -0.093876 -0.107114 -0.189314 -0.193525 -0.475902 -0.460974 -0.228272 -0.235493 -0.463338 -0.461829 -0.367175 -0.252344 -0.247165 -0.571516 -0.386298 -0.374606 -0.385252 -0.463612 -0.466872 -0.571022 0.303255 0.306286 0.286139 0.287287 0.289895 0.301657 0.257164 0.263994 0.289163 0.292221 0.235881 0.268002 0.268076 0.236342 0.267336 0.270567 0.304168 0.260042 0.268933 0.296352 0.293014 0.279754 0.303811 0.291037 0.275456 0.288602 0.289969 0.288439 0.288686 0.274308 0.302343 0.267323
chargesum: 2.00000
title: Mulliken charges with hydrogens summed into heavy atoms:
elementType: N N C C C C C C C C C C C C C C C C C C
charge: -0.093876 -0.107114 0.113941 0.112760 0.097524 0.130578 0.028891 0.028502 0.040544 0.042589 0.214209 0.014992 0.023402 0.261627 0.203068 0.208960 0.181241 0.114959 0.110253 0.272952
polarizability: 2.25243068e+02 -1.20244824e-01 1.71381065e+02 2.33292305e+00 1.86693472e+00 1.65655437e+02
1716.lowfreq: -12.1936 -0.0007 -0.0005 -0.0002 7.9887 20.9404 29.6580 36.6553 55.5005
frequency: 28.8402 36.3520 55.3396 85.8539 97.9854 106.6144 128.2604 177.8992 185.4248 209.0733 218.7691 232.2327 242.7259 252.8143 267.6978 309.1170 331.0706 354.5725 370.7574 396.8235 405.1818 418.2047 431.7383 454.4095 479.1053 560.5504 563.1809 586.8607 618.8365 633.9408 667.3310 689.8367 712.2056 731.2805 743.2228 760.2007 788.5424 798.2912 809.7611 809.9414 810.9625 853.2321 872.4656 890.0757 893.1014 898.5453 903.1761 913.5979 939.8551 949.0059 959.8914 966.9940 970.9011 982.3559 995.1064 1002.0672 1017.5173 1018.8722 1027.1708 1050.2123 1057.0143 1063.4990 1074.1805 1076.6560 1085.5634 1094.0848 1107.9371 1131.0594 1142.2179 1157.2742 1164.5409 1166.5029 1189.9367 1194.5989 1212.6590 1222.8359 1224.7938 1226.5789 1229.7313 1236.2104 1239.1025 1244.7304 1255.0422 1271.2086 1294.2941 1302.1746 1306.8979 1307.8207 1311.8565 1314.8648 1318.8845 1326.0570 1331.8072 1335.6296 1341.9930 1347.6294 1357.9761 1359.7450 1370.9756 1378.4081 1414.0295 1430.2613 1436.3038 1450.9838 1454.0847 1461.2719 1467.3632 1470.9330 1471.4665 1474.3581 1479.8715 1482.9427 1484.6288 1489.5276 1493.9280 1498.1605 1505.8344 1617.6424 3003.4067 3012.9813 3017.1151 3017.4284 3020.2305 3023.4513 3027.8076 3029.2972 3030.1720 3032.2310 3033.2139 3037.0436 3044.3971 3045.9642 3052.8356 3053.2283 3073.7181 3086.5284 3093.6780 3095.7594 3102.1186 3107.2447 3108.9054 3109.9704 3116.5039 3126.8637 3136.1378 3140.3671 3144.1093 3152.9115 3154.5731 3165.2749
redmass: 2.8954 4.0160 3.4581 2.9539 1.7170 2.6954 2.7296 2.5424 2.5457 2.0155 1.8871 1.5997 1.9899 1.4048 2.0554 2.4865 2.2311 2.5690 2.3404 2.8667 2.6073 2.2229 2.3061 2.7698 3.1420 4.0080 3.8559 3.4912 4.6846 3.6776 3.2609 2.8564 2.5638 2.2223 1.8649 4.0430 1.4747 1.6736 1.6152 1.5563 2.2138 2.6272 3.1741 2.7448 2.5725 2.5496 2.7077 2.2552 2.5687 2.7257 2.1283 1.9322 1.4145 2.0546 1.6489 2.6032 2.5084 2.6751 1.9400 3.6862 2.2553 2.2302 1.7659 1.9038 2.4523 1.9845 1.7013 1.0603 1.7750 1.6460 1.2189 1.3974 1.2665 1.5046 1.2950 1.3958 1.2294 1.1901 1.2664 1.2159 1.3778 1.4319 1.4275 1.4317 1.2819 1.2454 1.2410 1.2657 1.2410 1.2282 1.3001 1.3101 1.3092 1.3615 1.3330 1.3496 1.4525 1.2645 1.7417 1.3193 1.2997 1.1509 1.1501 1.0832 1.0753 1.0719 1.0765 1.0752 1.0641 1.0626 1.0602 1.0632 1.0874 1.0688 1.0777 1.0660 1.0883 5.7304 1.0642 1.0624 1.0707 1.0765 1.0613 1.0564 1.0366 1.0460 1.0520 1.0542 1.0855 1.0595 1.0621 1.0872 1.0651 1.0884 1.0997 1.1067 1.1017 1.1046 1.1073 1.1084 1.1065 1.1080 1.1079 1.1077 1.0872 1.1057 1.1060 1.1035 1.1037 1.1048
irintensity: 0.0656 1.4089 0.3468 0.3899 0.0631 0.6336 0.1888 0.3500 0.3925 0.3474 0.2310 0.6211 1.6850 0.0353 0.0618 0.3125 0.1580 0.1509 1.4415 0.1356 0.2916 0.4172 1.2093 3.6185 0.8806 0.4530 1.3552 1.4278 1.1129 0.1550 3.2429 0.2001 16.7796 27.3624 35.1076 4.0803 9.7883 11.1587 16.5760 10.2965 5.1733 9.5012 13.2028 29.1043 9.8434 1.8498 34.0024 11.4290 16.1767 23.9802 1.8232 0.0442 2.2282 0.3782 4.6904 10.0791 1.5093 3.8964 0.9019 0.8523 0.6873 1.6137 0.2855 0.3650 0.4933 0.3435 2.1586 0.4360 0.3793 0.4447 6.4635 0.2827 7.9398 2.8762 2.0459 3.7225 0.7311 0.7129 1.3889 10.8705 10.1588 1.0018 3.5611 6.4267 2.0361 0.9749 4.1295 1.9747 0.5865 1.6676 0.7200 7.0564 1.0376 0.5681 5.1773 6.4930 3.6818 6.3137 10.9822 0.1945 0.6998 29.0369 26.3797 15.0617 6.7155 4.4357 4.2640 4.0638 3.1097 57.2267 36.5332 4.3572 14.8295 8.9552 61.0087 22.1509 7.5719 0.9499 13.6231 12.5545 12.3200 17.9241 9.2514 4.0491 11.2193 4.7139 3.2430 3.6896 13.7068 15.3318 4.4508 40.4819 1.5065 9.8726 1.2736 0.0878 17.5712 0.2758 2.7020 0.6616 1.0777 5.6465 1.0360 8.0051 1.0074 3.1067 2.8591 1.9990 1.6240 8.4497
temp: 298.150 k
press: 1.00000 atm
elementType: 7 7 6 6 6 6 6 6 6 6 6 6 6 6 6 6 6 6 6 6 1 1 1 1 1 1 1 1 1 1 1 1 1 1 1 1 1 1 1 1 1 1 1 1 1 1 1 1 1 1 1 1
symmnumber: 1
zpe: 1256198.5 jmol-1
zpe.correction: 0.478461 hartree
zpe.thermalcorrener: 0.497588 hartree
zpe.thermalcorrenthalpy: 0.498532 hartree
zpe.thermalcorrgfe: 0.431458 hartree
zpe.sumelectzpe: -812.424725 hartree
zpe.sumelectthermal: -812.405597 hartree
zpe.sumelectthermalent: -812.404653 hartree
zpe.sumelectthermalfe: -812.471727 hartree
dipole: -11.7118 3.5234 -0.0831
dipole: 12.2306
quadrupole: -2.7610 -94.1073 -102.0937
quadrupole: 4.6160 -1.0288 0.5923
quadrupole: 63.5596 -27.7866 -35.7730 4.6160 -1.0288 0.5923
hfenergy: -812.9031854 hartree
pointgroup: C01 [X(C18H32N2)]
dipole: 4.6482155 1.2140136 0.2729782 debye
polarizability: 225.1663706|-1.9652768|171.9115423|2.3655476|-0.8778518|165.2016582 unknown
InChI: InChI=1S/C18H32N2/c1-19(9-3-4-10-19)11-12-20(2)13-17-15-5-6-16(8-7-15)18(17)14-20/h5-6,15-18H,3-4,7-14H2,1-2H3
charge 2 multiplicity 1
52 atoms
N  -0.22218 1.148659 0.229066
N  3.570738 0.100648 -0.038917
C  -2.350982 0.178564 1.034413
C  -2.658083 1.103371 -0.20734
C  -0.821865 -0.039171 1.034278
C  -1.299432 1.36648 -0.884348
C  -3.162392 -1.159024 0.900135
C  -3.684084 0.378833 -1.150977
C  -4.678219 -0.752047 0.919964
C  -4.988539 0.169378 -0.302623
C  1.126523 0.824144 -0.425541
C  -2.870348 -1.79592 -0.449845
C  -3.145223 -0.99444 -1.520208
C  -0.138879 2.40106 1.100677
C  2.263139 0.593003 0.597558
C  4.656904 -0.069834 1.07178
C  3.477821 -1.336329 -0.623741
C  5.691613 -1.044915 0.47385
C  4.929471 -1.867368 -0.620789
C  4.084056 1.076624 -1.099249
H  -2.662734 0.676727 1.969821
H  -3.112684 2.05423 0.123861
H  -0.373438 -0.059368 2.040711
H  -0.561739 -0.956076 0.475846
H  -1.100857 0.607747 -1.661576
H  -1.172197 2.379836 -1.298615
H  -2.936791 -1.832638 1.745303
H  -3.899071 1.002042 -2.036152
H  0.958802 -0.076944 -1.040413
H  1.355863 1.670635 -1.095104
H  -4.911354 -0.242915 1.873754
H  -5.290538 -1.667773 0.88647
H  -5.760857 -0.281116 -0.94693
H  -5.376149 1.151815 0.0257
H  -2.55758 -2.841734 -0.538003
H  -3.07361 -1.32471 -2.561813
H  -1.15471 2.671053 1.420898
H  0.473792 2.202339 1.992826
H  0.289834 3.227689 0.512244
H  2.515979 1.524832 1.131658
H  1.973153 -0.170296 1.340006
H  4.143121 -0.499327 1.948829
H  5.055374 0.923623 1.332555
H  3.019113 -1.299858 -1.62428
H  2.830536 -1.911991 0.060565
H  6.090509 -1.695778 1.267674
H  6.551093 -0.50824 0.04157
H  5.403549 -1.74812 -1.608063
H  4.93053 -2.945288 -0.394733
H  4.140217 2.087338 -0.665575
H  5.087835 0.759365 -1.414722
H  3.417369 1.067789 -1.974256
