program: Gaussian 09
title: 000203087
version: EM64L-G09RevD.01
frameworkgroup: C1[X(C25H27N)]
method: RPBEPBE
basis: SDD
operation: Freq
keyword: #pfreq=noraman
keyword: PBEPBE/SDD
title: #p freq=noraman PBEPBE/SDD
converged: YES YES NO NO
title: Mulliken charges:
elementType: N C C C C C C C C C C C C C C C C C C C C C C C C C H H H H H H H H H H H H H H H H H H H H H H H H H H H
charge: -0.102133 -0.046790 -0.585839 -0.444669 -0.740035 0.504033 -0.647714 -0.379355 0.276101 -0.438538 -0.401061 0.288490 0.227559 -0.229396 -0.235324 -0.244328 -0.393260 -0.398213 -0.424132 -0.405885 -0.228890 -0.237436 -0.231903 -0.249005 -0.248414 -0.249654 0.232340 0.215496 0.231041 0.249898 0.193408 0.246760 0.223584 0.210161 0.220891 0.254447 0.187776 0.240582 0.232382 0.233167 0.223549 0.223031 0.227098 0.257439 0.255158 0.246036 0.304107 0.226042 0.225838 0.224338 0.225316 0.228445 0.227458
chargesum: 0.00000
title: Mulliken charges with hydrogens summed into heavy atoms:
elementType: N C C C C C C C C C C C C C C C C C C C C C C C C C
charge: -0.102133 0.185550 -0.139302 -0.001363 -0.059529 0.504033 0.015401 -0.138773 0.276101 -0.206156 -0.167895 0.288490 0.227559 -0.005847 -0.012293 -0.017230 -0.135821 -0.143054 -0.178095 -0.101778 -0.002848 -0.011598 -0.007565 -0.023689 -0.019969 -0.022196
polarizability: 3.86380891e+02 -1.52884012e+01 2.57953070e+02 -6.86516770e+00 1.71341580e+01 2.02079238e+02
1716.lowfreq: -9.1367 -0.0004 0.0001 0.0007 1.7344 3.3802 16.4274 19.7091 26.1031
frequency: 16.0995 19.6325 25.9819 44.7766 50.5720 59.7390 67.2493 70.1405 78.1015 96.9497 107.9809 144.9700 191.0970 212.3429 215.9402 221.9788 235.4541 257.9160 269.3351 288.7624 301.9497 344.2894 361.7105 373.6182 404.9225 407.4510 411.7349 430.6253 444.2952 451.1970 471.2471 522.8674 530.9313 570.9291 608.0192 615.2986 616.5990 618.5851 637.5791 650.6074 703.9533 705.2173 708.0043 711.2965 736.6025 762.4645 775.7847 782.2862 821.6088 840.6282 854.1557 854.7250 864.3649 873.9710 890.9440 894.3822 916.3503 925.8260 938.4229 942.2111 975.6334 978.7584 979.7612 985.3032 989.1836 990.0666 990.3302 992.8785 995.3440 1004.1338 1027.2110 1027.9704 1030.9771 1044.3192 1046.0254 1075.5901 1087.1330 1087.4413 1093.3899 1110.3181 1119.6226 1137.6994 1167.8644 1171.2400 1172.1092 1173.2359 1187.2502 1191.8932 1193.1957 1202.1468 1214.5249 1218.0879 1248.9616 1276.0645 1296.6826 1311.3652 1314.9139 1330.8553 1333.7096 1337.3931 1359.9353 1368.0271 1374.4630 1378.3094 1381.0009 1383.4431 1428.8014 1433.6325 1434.4396 1440.1522 1460.9546 1468.3480 1471.9101 1477.8240 1479.2906 1481.1378 1484.7402 1488.4029 1495.9708 1578.0742 1580.2167 1592.3014 1607.3890 1609.9411 1614.1026 1621.3340 2859.2380 2874.0219 2972.5476 2980.8574 2991.5530 3021.1276 3033.0311 3053.0070 3073.2154 3077.5575 3082.4059 3099.3354 3103.3126 3111.7424 3116.1298 3121.0319 3121.7013 3127.8106 3130.6061 3131.1192 3140.5236 3142.0840 3144.0457 3149.0906 3160.4403 3160.9787 3163.7477
redmass: 3.7542 5.1502 5.0233 3.5446 3.3688 4.1542 4.0246 4.3645 4.1496 3.4196 4.1026 4.2250 2.8327 1.1983 2.9171 4.1311 2.8135 2.6898 1.5651 3.9551 2.9119 3.3391 2.1034 2.4316 2.8194 2.8728 2.9081 3.4455 3.5294 3.2936 3.5778 2.9499 3.4258 4.3136 4.8533 5.1074 6.1309 5.9780 4.0961 3.6294 2.0068 1.8466 3.0160 1.8112 2.0957 2.2182 2.1356 2.0728 3.2698 2.3770 1.2507 1.2495 1.2517 1.8734 1.7303 1.9217 1.4630 1.5177 1.5176 1.8571 1.3943 1.7397 1.7692 2.6112 4.5023 4.6969 2.0198 1.3156 1.3446 1.3722 2.1924 2.3568 2.1069 1.6314 2.1500 2.0490 1.6350 1.6601 1.7192 1.8659 2.2454 1.9117 2.2234 1.0536 1.0683 1.0974 1.1167 1.1953 1.8239 1.1549 1.6788 1.9647 1.5959 1.9099 1.4750 1.3464 1.3781 1.3521 1.2695 1.3432 1.5480 1.8793 5.0365 1.4245 2.9414 3.9225 1.1686 2.2673 2.2429 2.1388 1.0596 1.0862 1.1080 1.0960 1.9336 1.2706 1.7944 2.2641 1.0509 5.6504 5.8128 6.0085 6.0047 5.7719 6.1561 7.6042 1.0685 1.0562 1.0828 1.0359 1.0600 1.0737 1.0873 1.1020 1.0993 1.1004 1.0988 1.0923 1.0891 1.0870 1.0866 1.0845 1.0856 1.0874 1.0908 1.0906 1.0923 1.0958 1.0950 1.0961 1.1011 1.1015 1.1015
irintensity: 0.0058 0.0240 0.0279 0.0890 0.0695 0.4056 0.6835 0.1111 0.1123 0.2214 0.7080 0.5298 0.4314 0.0600 1.0696 0.6286 1.5029 1.4443 1.2587 0.5603 0.5394 1.0316 0.4655 5.1148 0.0053 0.1020 0.3219 0.7283 4.1160 4.8941 2.1182 7.5192 4.2288 2.9522 10.4429 10.7895 3.1536 4.1628 21.2033 3.8700 26.6230 65.4404 25.8902 44.1721 5.9496 64.2611 17.2479 46.1320 2.3497 0.6096 0.0155 0.4779 3.4770 9.4230 0.3924 19.3822 1.6726 3.5913 11.9102 11.3168 0.0391 0.8735 0.1176 2.8688 0.1593 0.1215 0.6393 0.2447 0.3505 4.5196 9.0644 3.3347 13.0020 4.1960 39.9860 10.2927 5.1958 1.1287 12.6106 12.5229 24.4113 50.0113 2.9107 0.1591 0.0800 0.1292 0.0083 3.5330 16.6995 2.0191 10.9024 10.1566 9.2729 12.6875 4.3107 2.2302 1.2209 1.6563 2.0593 4.0806 4.9546 5.3227 2.3970 36.3128 13.8186 6.5912 7.1366 10.1945 8.7856 6.9116 8.3261 0.5748 13.1667 5.3299 3.7067 38.7458 6.4127 15.3166 4.1078 0.7747 1.5153 1.5412 7.3660 0.9876 13.9653 1.7044 48.2041 144.4489 11.3973 24.5696 35.8063 34.9454 13.2731 15.1784 26.0212 60.9458 33.4636 16.5647 27.7665 10.6184 6.8940 3.1029 1.4571 0.8223 12.4231 5.8661 21.2111 43.6078 37.9523 34.1229 33.5782 29.2487 26.2507
temp: 298.150 k
press: 1.00000 atm
elementType: 7 6 6 6 6 6 6 6 6 6 6 6 6 6 6 6 6 6 6 6 6 6 6 6 6 6 1 1 1 1 1 1 1 1 1 1 1 1 1 1 1 1 1 1 1 1 1 1 1 1 1 1 1
symmnumber: 1
zpe: 1170543.9 jmol-1
zpe.correction: 0.445837 hartree
zpe.thermalcorrener: 0.469920 hartree
zpe.thermalcorrenthalpy: 0.470864 hartree
zpe.thermalcorrgfe: 0.389213 hartree
zpe.sumelectzpe: -1021.719371 hartree
zpe.sumelectthermal: -1021.695288 hartree
zpe.sumelectthermalent: -1021.694344 hartree
zpe.sumelectthermalfe: -1021.775994 hartree
dipole: -0.1952 -0.8167 -0.2088
dipole: 0.8653
quadrupole: -142.9029 -149.4337 -150.9348
quadrupole: -0.8756 -2.1233 3.3430
quadrupole: 4.8542 -1.6765 -3.1777 -0.8756 -2.1233 3.3430
hfenergy: -1022.1652078 hartree
pointgroup: C01 [X(C25H27N1)]
dipole: 0.0641961 0.3140783 -0.1145625 debye
polarizability: 386.9914204|-7.5836671|252.6155509|13.2647562|-22.3848657|206.8062267 unknown
InChI: InChI=1S/C25H27N/c1-21(20-22-12-6-3-7-13-22)26(2)19-18-25(23-14-8-4-9-15-23)24-16-10-5-11-17-24/h3-18,21H,19-20H2,1-2H3
charge 0 multiplicity 1
53 atoms
N  0.747188 1.619918 0.415267
C  2.227935 1.674918 0.173529
C  2.772563 0.27139 -0.23565
C  -0.063532 1.288682 -0.800393
C  2.696717 2.772222 -0.822302
C  4.282022 0.154171 -0.079067
C  0.244537 2.810245 1.136911
C  -1.56032 1.261279 -0.560399
C  -2.34817 0.16478 -0.302215
C  5.142694 0.13949 -1.206278
C  4.865708 0.064571 1.213036
C  -3.837979 0.336101 -0.245862
C  -1.793529 -1.205444 -0.067488
C  6.544961 0.041685 -1.051567
C  6.26524 -0.033308 1.374147
C  7.112052 -0.043925 0.240471
C  -4.616872 -0.369938 0.713405
C  -2.438254 -2.348987 -0.61917
C  -4.510851 1.223651 -1.132018
C  -0.624197 -1.401775 0.719708
C  -6.012321 -0.177507 0.799508
C  -1.921999 -3.644776 -0.40678
C  -5.90685 1.41564 -1.04816
C  -0.1128 -2.700409 0.936021
C  -6.665354 0.718229 -0.079184
C  -0.75637 -3.827573 0.37467
H  2.66693 1.909034 1.165483
H  2.492943 0.053152 -1.283729
H  2.2642 -0.474757 0.403658
H  0.273099 0.304001 -1.169778
H  0.117154 2.034934 -1.614291
H  3.800026 2.80532 -0.85397
H  2.336127 3.772441 -0.521562
H  2.337905 2.568791 -1.848623
H  0.870224 2.983209 2.03102
H  -0.79019 2.624263 1.473558
H  0.240947 3.74975 0.530809
H  -2.068786 2.231721 -0.64387
H  4.709475 0.200791 -2.212448
H  4.215389 0.060979 2.097433
H  7.192183 0.029255 -1.936123
H  6.695783 -0.107032 2.37955
H  8.19816 -0.122559 0.363268
H  -4.119447 -1.06181 1.401883
H  -3.342777 -2.216591 -1.223503
H  -3.936262 1.741946 -1.908274
H  -0.127593 -0.525529 1.156592
H  -6.589791 -0.724204 1.553665
H  -2.428157 -4.510886 -0.848181
H  -6.404665 2.0981 -1.746567
H  0.785108 -2.833481 1.550972
H  -7.749624 0.863619 -0.016152
H  -0.359284 -4.834485 0.546739
