program: Gaussian 09
title: 000203056
version: EM64L-G09RevD.01
frameworkgroup: C1[X(C17H28N2O3)]
method: RPBEPBE
basis: SDD
operation: Freq
keyword: #p
keyword: freq=noraman
keyword: PBEPBE/SDD
title: #p freq=noraman PBEPBE/SDD
converged: YES YES NO NO
title: Mulliken charges:
elementType: O O O N N C C C C C C C C C C C C C C C C C H H H H H H H H H H H H H H H H H H H H H H H H H H H H
charge: -0.283667 -0.400855 -0.254631 -0.573552 -0.715411 -0.376174 -0.372467 -0.372341 -0.409326 -0.352203 -0.301959 -0.356658 0.412952 -0.574668 0.182022 -0.203799 -0.695885 -0.622745 -0.327739 0.534366 -0.460501 0.198025 0.193666 0.194282 0.191621 0.190805 0.189304 0.189737 0.211259 0.211458 0.188328 0.188521 0.201942 0.199781 0.194916 0.194873 0.216420 0.226691 0.285865 0.210135 0.215473 0.209816 0.234747 0.240586 0.213108 0.282585 0.274271 0.300731 0.304284 0.372009
chargesum: 0.00000
title: Mulliken charges with hydrogens summed into heavy atoms:
elementType: O O O N N C C C C C C C C C C C C C C C C C
charge: -0.283667 -0.028846 -0.254631 -0.016695 -0.110396 0.011774 0.009959 0.006701 0.013391 0.024646 0.099765 0.033132 0.412952 -0.131558 0.182022 0.082066 -0.060461 -0.387998 -0.087153 0.534366 -0.247393 0.198025
polarizability: 2.81746324e+02 -1.66768214e+01 2.11558501e+02 2.04516247e+00 -2.19803837e+01 1.52566382e+02
1716.lowfreq: -29.6120 -8.8277 -2.9791 -0.0012 -0.0011 -0.0006 4.2420 10.2879 20.6359
frequency: -27.7127 7.5097 20.4578 23.5149 30.5928 41.6254 44.7234 65.6781 72.0875 83.4911 93.5405 120.2544 125.6734 140.4762 149.7863 156.7400 169.8656 182.4930 224.8072 237.2080 258.2913 275.6482 278.5658 300.9477 302.5812 312.7692 335.6733 339.4364 365.0430 376.5912 437.6945 447.0892 462.1469 462.4845 509.4564 538.1177 572.8602 584.2786 599.6159 620.7661 639.4512 719.1087 721.0092 723.7605 728.1710 753.5432 755.4622 764.7165 775.4992 791.9722 804.2558 866.1877 874.0009 887.7611 906.4466 932.0399 940.4357 959.8719 973.8750 988.4135 993.8294 1010.0191 1025.2908 1039.3796 1047.7507 1061.8025 1077.3592 1079.8982 1087.0091 1098.9736 1113.4246 1125.0989 1143.6827 1149.8046 1182.4497 1186.9063 1187.8993 1212.1512 1218.3960 1224.0809 1260.0807 1261.3833 1262.4269 1277.7775 1280.9505 1283.0495 1290.5785 1292.8852 1294.8120 1302.6365 1317.7434 1332.6080 1336.5005 1352.4224 1355.1852 1375.9708 1387.4204 1392.6524 1414.5141 1445.9029 1458.0540 1459.8099 1460.5947 1465.5057 1468.9324 1475.3371 1477.6837 1481.5134 1486.9732 1489.2561 1505.3119 1592.3028 1612.8283 1632.9986 1644.3001 1665.3852 2936.1221 2949.8042 2951.7772 2954.2494 2961.5860 2967.4078 2971.3551 2984.1633 2988.2683 2991.1782 2992.2937 2994.1647 3004.4735 3021.8429 3037.1455 3056.9121 3057.6710 3068.0049 3070.5505 3085.6155 3114.0600 3123.1202 3159.4830 3460.4777 3493.9480 3573.4466 3597.2482 3714.3662
redmass: 1.5507 5.0741 5.4232 4.3989 6.7208 4.7191 4.9101 2.8942 1.9972 3.1696 3.8029 1.9535 2.5156 3.6399 2.2605 4.3593 4.0188 4.0457 1.9282 1.0968 3.4184 2.1698 3.5110 2.3340 1.2505 2.7011 1.0623 3.8645 5.0923 3.3483 3.9472 2.8745 3.3234 3.2238 3.5580 3.4569 1.9415 2.1404 3.3294 2.0675 2.2320 1.0660 3.6974 4.3537 1.0852 5.1877 1.1198 4.5262 3.1784 1.4418 1.2288 1.1993 1.6267 1.9095 1.3684 2.3349 1.1851 2.1856 6.9308 4.6185 4.6987 1.1052 3.4822 1.6022 3.1480 2.7568 2.4719 2.2898 2.2497 1.8112 2.2509 2.9374 1.4156 1.4271 1.5447 1.4373 1.6752 2.3112 1.2934 1.3995 1.2770 1.6050 1.3061 1.0533 1.4469 1.1258 1.1124 1.4066 1.1096 1.3264 1.2866 2.4676 1.4750 1.6253 1.6289 1.7997 1.2168 3.2375 1.7665 1.5062 2.0888 1.0742 1.0743 1.0699 1.0852 1.0917 1.0450 1.1090 1.1141 1.1466 2.3038 7.4291 1.3344 1.7921 2.1504 3.5025 1.0549 1.0586 1.0585 1.0590 1.0590 1.0587 1.0362 1.0966 1.0594 1.1040 1.0999 1.0585 1.1023 1.1044 1.1048 1.1049 1.1018 1.1007 1.0993 1.0890 1.0911 1.0887 1.0940 1.0444 1.0636 1.0447 1.0984 1.1041
irintensity: 0.0119 0.2127 1.9594 0.0195 3.3257 0.2679 1.0490 1.0840 0.2321 0.9598 0.7189 0.9596 0.5761 2.9177 0.8704 0.9473 0.5409 2.4880 32.5253 0.0211 7.6412 24.2656 8.2194 14.2819 295.8049 8.1210 1.9934 3.6326 0.0743 0.4368 10.7718 0.5164 10.5205 8.9316 2.1324 12.5509 101.9894 1.0632 19.9283 259.7776 83.5362 16.2034 25.1670 7.4999 0.0732 32.3729 7.0683 6.5157 5.2404 33.8139 12.2197 0.0538 17.9097 2.9214 0.3574 0.5517 0.8318 15.7569 73.5422 49.1882 7.2236 0.1170 6.3872 21.3981 1.4001 211.6988 2.7493 3.3179 18.6543 8.4226 36.1563 10.3907 20.3905 0.8751 18.6639 12.0662 0.3388 265.8648 3.7412 0.3961 0.2429 5.6428 2.3627 0.1117 0.0523 0.9875 0.1163 7.7900 0.0373 0.2818 15.9376 4.6166 0.1501 1.8284 0.2288 11.4483 11.3596 40.1110 12.3752 23.3173 8.7736 0.2275 0.0695 1.1311 1.8455 17.4266 12.4093 13.8304 35.4764 61.7646 186.5474 10.2765 136.7928 13.4979 201.5808 113.3083 39.7065 0.1170 4.5886 0.2039 25.8491 144.6840 38.3643 0.1919 42.9872 25.8517 0.3392 32.4840 0.4350 0.1226 84.2030 104.6209 9.3231 99.2123 54.9224 10.2217 16.2842 28.6422 16.6941 5.3055 13.1373 66.2053 4.9860 18.3688
temp: 298.150 k
press: 1.00000 atm
elementType: 8 8 8 7 7 6 6 6 6 6 6 6 6 6 6 6 6 6 6 6 6 6 1 1 1 1 1 1 1 1 1 1 1 1 1 1 1 1 1 1 1 1 1 1 1 1 1 1 1 1
symmnumber: 1
zpe: 1120403.2 jmol-1
zpe.correction: 0.426739 hartree
zpe.thermalcorrener: 0.451963 hartree
zpe.thermalcorrenthalpy: 0.452907 hartree
zpe.thermalcorrgfe: 0.367004 hartree
zpe.sumelectzpe: -998.061286 hartree
zpe.sumelectthermal: -998.036063 hartree
zpe.sumelectthermalent: -998.035119 hartree
zpe.sumelectthermalfe: -998.121022 hartree
dipole: -0.7327 -3.1294 0.0181
dipole: 3.2140
quadrupole: -120.2713 -133.7758 -130.1266
quadrupole: -14.9020 3.3198 -8.2502
quadrupole: 7.7867 -5.7179 -2.0687 -14.9020 3.3198 -8.2502
hfenergy: -998.4880253 hartree
pointgroup: C01 [X(C17H28N2O3)]
dipole: 0.1833215 1.221504 0.2707246 debye
polarizability: 284.0905568|-9.7662564|197.8544325|-5.3106479|31.4051967|163.9262173 unknown
InChI: InChI=1S/C17H28N2O3/c1-2-3-4-5-6-7-10-22-16-9-8-14(18)11-13(16)12-15(19)17(20)21/h8-9,11,15,20H,2-7,10,12,18-19H2,1H3
charge 0 multiplicity 1
50 atoms
O  -0.515286 0.362704 -0.383747
O  -3.006729 -2.520864 1.591509
O  -4.380496 -3.287647 -0.112724
N  -1.837148 -3.570132 -1.50271
N  -5.83433 2.025642 0.630848
C  4.461998 0.264417 -0.065338
C  3.17412 1.019291 0.33425
C  5.749114 0.909891 0.495094
C  1.896442 0.354406 -0.227152
C  7.033739 0.143147 0.107603
C  0.62297 1.09002 0.197189
C  8.323105 0.782453 0.671683
C  -2.886524 0.099415 -0.668157
C  -2.594363 -1.126479 -1.512173
C  -1.816484 0.842434 -0.09188
C  -2.153011 -2.390221 -0.680326
C  9.599896 0.004878 0.285057
C  -4.211455 0.509638 -0.414959
C  -2.088941 1.973604 0.708387
C  -4.506773 1.643005 0.396039
C  -3.422063 2.371355 0.951729
C  -3.29007 -2.789601 0.253879
H  4.52861 0.21376 -1.172177
H  4.394238 -0.78493 0.290093
H  3.238687 2.068061 -0.024137
H  3.111338 1.070188 1.441532
H  5.678115 0.9683 1.601619
H  5.823773 1.956847 0.132969
H  1.834504 -0.694358 0.122757
H  1.941406 0.32301 -1.333026
H  7.108404 0.085724 -0.998707
H  6.958411 -0.904394 0.467863
H  0.528972 1.108918 1.304096
H  0.627225 2.137838 -0.172934
H  8.24578 0.842746 1.776651
H  8.400664 1.827742 0.308515
H  -3.483073 -1.408703 -2.107787
H  -1.759435 -0.917605 -2.206513
H  -1.272686 -2.119333 -0.077168
H  9.559537 -1.034585 0.66223
H  10.507036 0.480497 0.70131
H  9.717166 -0.042752 -0.814215
H  -5.033681 -0.066566 -0.859149
H  -1.277343 2.557748 1.15224
H  -3.617676 3.251599 1.57623
H  -2.649741 -3.954292 -1.996145
H  -1.01528 -3.453653 -2.101076
H  -6.048679 2.835661 1.203491
H  -6.604979 1.496017 0.236159
H  -3.798106 -2.75864 2.149281
