program: Gaussian 09
title: 000203020
version: EM64L-G09RevD.01
frameworkgroup: C1[X(C11H11NO2S)]
method: RPBEPBE
basis: SDD
operation: Freq
keyword: #p
keyword: freq=noraman
keyword: PBEPBE/SDD
title: #p freq=noraman PBEPBE/SDD
converged: YES YES NO NO
title: Mulliken charges:
elementType: S O O N C C C C C C C C C C C H H H H H H H H H H H
charge: 0.233318 -0.334696 -0.270717 -0.374728 0.401478 -0.594076 0.541772 0.233823 -0.441422 -0.327927 -0.248442 -0.818029 -0.519773 0.298443 -0.606147 0.232331 0.301682 0.260088 0.237714 0.229969 0.237915 0.261505 0.329800 0.231676 0.231445 0.272996
chargesum: 0.00000
title: Mulliken charges with hydrogens summed into heavy atoms:
elementType: S O O N C C C C C C C C C C C
charge: 0.233318 -0.334696 -0.270717 -0.044929 0.401478 -0.594076 0.541772 0.233823 -0.209091 -0.026246 0.011646 -0.112430 -0.258268 0.298443 0.129970
polarizability: 2.16030870e+02 -3.04962385e-01 1.73521194e+02 5.27709833e-02 1.61830259e-02 6.74560507e+01
1716.lowfreq: -9.8228 0.0014 0.0019 0.0024 0.9296 3.5997 15.7447 39.2932 96.9766
frequency: 15.6566 39.2909 96.9755 99.8939 103.0863 134.2039 144.5127 177.2311 202.1931 204.9717 235.7051 270.3740 341.6454 354.7415 416.1386 451.2293 489.0861 521.1703 555.0851 580.0451 589.8641 598.8800 655.0202 683.3963 691.4753 701.9410 720.1047 755.3711 785.3492 836.0705 845.2961 901.1044 921.5735 956.8615 959.5647 1042.2142 1045.6714 1077.2815 1093.9292 1123.9292 1126.6798 1146.9128 1176.8969 1191.3184 1228.4660 1257.6381 1317.2995 1374.3587 1395.7158 1403.3371 1431.0731 1453.6813 1465.7915 1466.6961 1477.8118 1483.6382 1513.2416 1523.0998 1584.0417 1599.3356 1692.2161 2971.0062 2981.6168 3045.1785 3059.9766 3088.6278 3114.7536 3135.9953 3193.3847 3207.6676 3235.6545 3580.0353
redmass: 5.8995 4.5902 1.0971 4.4097 1.0952 2.9238 4.9078 4.6417 5.0629 4.8577 3.6714 6.2272 5.1066 4.5377 6.7305 4.2240 4.7541 6.5658 3.5761 1.1855 3.6210 6.1096 8.4433 12.0217 6.9409 1.5733 6.5663 5.2593 2.7088 1.3056 4.6276 1.3328 4.9646 1.9781 1.3297 1.9920 1.5169 5.6722 1.1765 2.7260 1.2825 1.6688 1.8695 2.1110 2.1852 1.8053 2.4014 5.0359 1.7911 2.5209 1.1656 1.6760 1.0448 2.0001 1.1974 1.0436 1.3798 5.5544 8.2793 7.2436 9.3399 1.0377 1.0354 1.0975 1.1027 1.0981 1.0982 1.0909 1.0902 1.0936 1.1013 1.0773
irintensity: 5.7175 3.0516 0.2517 1.9207 0.0861 0.6157 2.4858 0.0454 1.5233 6.9115 1.5295 3.1755 26.5400 1.9910 4.5487 1.5999 2.0662 0.1920 2.6298 132.1794 0.9403 4.4618 0.8525 26.5034 2.0000 47.9934 4.6328 13.7177 39.5768 37.2843 0.0230 4.9316 116.0331 4.7002 5.0340 25.9114 8.3787 190.3442 5.6270 224.8767 0.0108 46.4228 302.7958 279.2585 33.1811 4.3584 0.6522 8.6583 1.1541 45.9756 29.4878 382.2710 15.2652 15.9124 25.7320 16.1157 158.7366 3.4461 11.1744 4.2747 240.2951 34.8988 84.9037 18.3654 35.8816 18.1046 3.4227 16.2726 2.7727 4.0062 1.4830 35.5600
temp: 298.150 k
press: 1.00000 atm
elementType: 16 8 8 7 6 6 6 6 6 6 6 6 6 6 6 1 1 1 1 1 1 1 1 1 1 1
symmnumber: 1
zpe: 516435.5 jmol-1
zpe.correction: 0.196700 hartree
zpe.thermalcorrener: 0.211324 hartree
zpe.thermalcorrenthalpy: 0.212268 hartree
zpe.thermalcorrgfe: 0.153260 hartree
zpe.sumelectzpe: -1027.965092 hartree
zpe.sumelectthermal: -1027.950468 hartree
zpe.sumelectthermalent: -1027.949524 hartree
zpe.sumelectthermalfe: -1028.008532 hartree
dipole: -1.5296 -2.4687 -0.0250
dipole: 2.9043
quadrupole: -77.5788 -85.5377 -99.3138
quadrupole: 13.7641 0.1026 -0.0326
quadrupole: 9.8979 1.9391 -11.8371 13.7641 0.1026 -0.0326
hfenergy: -1028.1617919 hartree
pointgroup: C01 [X(C11H11N1O2S1)]
dipole: -0.7172383 -0.8747836 -0.1610705 debye
dipolederiv: -0.2988411 0.1563449 0.0331639 -0.0463095 -0.1895242 -0.0489765 -0.0038462 -0.051481 0.073331 -2.728079 0.1730635 0.0653673 0.3940262 -0.4251849 -0.0503045 0.1068421 -0.0475904 -0.1987834 -0.8511098 0.0552197 0.0167542 0.1323231 -0.9707682 -0.1223392 0.0319425 -0.1208347 -0.367975 -1.4855622 -0.252573 -0.0353793 -0.4997069 -0.5021715 0.0081627 -0.0836578 0.0050213 -0.511445 -0.4436065 0.0267558 0.0110172 -0.0647516 0.0352853 0.000176 -0.0057392 -0.0011638 0.0401004 0.0862182 -0.3198937 -0.0613144 -0.3685291 0.3206261 0.0936688 -0.0700932 0.0932403 -0.1522845 0.1780799 0.2364078 0.0411429 0.1417294 -0.1166921 -0.0256194 0.0246493 -0.026763 0.0108037 1.6540017 -0.0045912 -0.020291 0.5352971 0.1577219 0.0095491 0.0816347 0.0165405 0.0658764 0.0769543 -0.130635 -0.0267485 0.0869687 0.0362085 0.0408766 0.0123064 0.0440499 -0.1864756 -0.3127796 0.0106713 0.0039675 -0.2731009 -0.1217281 0.0071488 -0.0486887 0.0045295 -0.1424153 -0.2124005 0.0285133 0.005917 0.0875058 0.0037799 0.0256448 0.0165562 0.0263144 -0.1380872 -0.1069705 -0.0391097 -0.0050297 0.0132824 0.0732833 0.0001081 0.0035155 0.000403 0.0713453 0.4187929 0.1490874 0.0185313 0.2943009 -0.120312 0.0293097 0.045128 0.0308688 -0.2952494 2.9714321 0.0767885 -0.0197445 -0.2788753 1.4266067 0.2165371 -0.0863132 0.2108046 0.3631763 0.6678635 0.0299525 -0.0002592 -0.237053 0.021832 -0.0444177 -0.0506113 -0.0473542 0.2655034 0.0483778 -0.055136 -0.0086702 -0.0585534 -0.0970948 -0.0446003 -0.009192 -0.0447269 0.144078 0.1482481 0.0500273 0.0093066 0.067184 0.0874638 -0.0180124 0.0121909 -0.018303 0.1792818 -0.0065886 -0.1077799 -0.017311 -0.0420226 0.0814958 -0.0186688 -0.0052722 -0.0179633 0.1838662 -0.0229538 -0.0252309 0.0604772 0.0262818 0.090265 -0.0678684 0.1167518 -0.0242575 -0.0611791 0.0836456 0.0366714 0.0068591 -0.0920589 -0.1428415 -0.0440015 -0.0160169 -0.0456185 0.1031377 -0.0274528 -0.0020533 -0.0658516 0.0664186 0.042908 0.1040596 -0.1004533 0.0619806 -0.0100938 0.0757843 -0.0140036 -0.0009089 0.0016132 -0.0164315 -0.042054 0.0019337 -0.0418077 0.206565 0.1606281 0.0271675 0.0076135 0.0975845 0.1668016 -0.0400303 0.0211627 -0.0388439 0.3627933 -0.1117733 -0.0398909 0.0650311 -0.0555133 0.0614325 0.1093293 0.1451479 0.0983486 -0.0420867 -0.1167041 -0.0158874 -0.0743822 -0.0028676 0.1178717 -0.0484627 -0.1541066 -0.0375383 -0.0921776 0.1547952 -0.0498861 -0.0092586 0.0748267 -0.0208334 -0.0292148 0.014229 -0.0278552 0.128394 unknown
polarizability: 215.2859578|-5.0959688|170.7561549|-2.7418097|18.9815441|70.9660018 unknown
InChI: InChI=1S/C11H11NO2S/c1-7-3-4-9(14-11(13)12-2)8-5-6-15-10(7)8/h3-6,12H,1-2H3
charge 0 multiplicity 1
26 atoms
S  3.248197 -1.686223 -0.31097
O  -1.582586 -0.28693 -0.000534
O  -2.836243 1.71245 0.398327
N  -3.83123 -0.380012 0.011263
C  0.755552 -0.723357 -0.105424
C  2.114597 -0.290339 -0.042964
C  2.495307 1.052156 0.196571
C  -0.267651 0.249247 0.083669
C  1.437261 1.970453 0.376193
C  0.06764 1.593066 0.32395
C  0.621269 -2.144197 -0.362919
C  3.950223 1.470901 0.255342
C  1.829007 -2.791902 -0.495631
C  -2.771671 0.482843 0.16255
C  -5.220894 0.071539 0.114353
H  1.680166 3.022536 0.564671
H  -0.717521 2.335204 0.468796
H  -0.345101 -2.644396 -0.442389
H  4.473207 1.244778 -0.693865
H  4.046639 2.552788 0.446035
H  4.491637 0.934077 1.058055
H  2.017766 -3.846463 -0.690068
H  -3.615987 -1.358736 -0.178577
H  -5.747327 -0.437351 0.942739
H  -5.771541 -0.110246 -0.826903
H  -5.212816 1.154513 0.314528
