program: Gaussian 09
title: 000203059
version: EM64L-G09RevD.01
frameworkgroup: C1[X(C20H31NO2)]
method: RPBEPBE
basis: SDD
operation: Freq
keyword: #p
keyword: freq=noraman
keyword: PBEPBE/SDD
title: #p freq=noraman PBEPBE/SDD
converged: NO YES NO NO
title: Mulliken charges:
elementType: O O N C C C C C C C C C C C C C C C C C C C C H H H H H H H H H H H H H H H H H H H H H H H H H H H H H H H
charge: -0.288619 -0.268375 -0.135549 -0.031222 -0.102291 -0.455754 -0.454313 -0.396085 -0.411173 -0.219448 -0.378441 -0.369257 -0.403585 -0.400802 -0.398568 0.409333 -0.404464 -0.371369 -0.516979 -0.365796 -0.378969 0.312641 -0.537484 0.215885 0.214726 0.204342 0.204841 0.226952 0.212173 0.191292 0.195138 0.190626 0.196243 0.220811 0.215729 0.179384 0.176420 0.210872 0.198054 0.191135 0.192050 0.198185 0.188933 0.212754 0.262378 0.255658 0.220892 0.226501 0.198012 0.247629 0.236802 0.243245 0.219660 0.219246
chargesum: 0.00000
title: Mulliken charges with hydrogens summed into heavy atoms:
elementType: O O N C C C C C C C C C C C C C C C C C C C C
charge: -0.288619 -0.268375 -0.135549 0.184663 0.112436 -0.046571 -0.015188 -0.009656 -0.024304 0.001363 0.016672 0.018035 -0.014397 -0.010567 0.003119 0.409333 -0.142086 -0.115711 0.128426 -0.118167 -0.142167 0.312641 0.144668
polarizability: 2.63573290e+02 -2.99571412e-02 2.23554425e+02 1.43106669e+01 9.09190060e+00 1.90557128e+02
1716.lowfreq: -6.0302 -0.0002 0.0005 0.0009 5.8756 13.9109 27.5277 36.0561 49.0525
frequency: 27.4207 35.8424 48.9925 55.9546 65.2284 85.4185 97.6446 104.5872 121.7154 133.8922 143.3014 168.3493 183.2927 207.9347 213.2442 226.2341 242.4016 257.8493 265.5004 292.9923 297.7376 318.9031 351.6964 364.9453 368.5948 416.1676 419.8859 433.7206 448.8716 456.2132 472.8195 486.9408 513.1475 525.3530 549.9505 626.6780 628.3486 651.7838 719.6181 751.4867 759.0296 785.7106 803.2705 806.7245 822.2264 839.8414 844.3385 853.2689 857.6360 859.1896 881.8569 906.7573 913.1346 930.3395 957.3230 958.0197 963.3589 980.0091 989.2809 998.8153 1004.3769 1031.8554 1037.8325 1045.7217 1057.6373 1065.8041 1069.7066 1096.5682 1104.0646 1108.4784 1111.5700 1116.3123 1117.6545 1120.8151 1130.3801 1146.7963 1154.2791 1155.2006 1161.2972 1173.7829 1198.9430 1206.3378 1214.0400 1224.5984 1235.5886 1256.5666 1259.4752 1264.1533 1277.5248 1280.3112 1293.6912 1297.0742 1305.9167 1325.2026 1328.9748 1329.2090 1333.9510 1337.2932 1338.0121 1341.4405 1345.5757 1348.2996 1354.3296 1369.9944 1389.4207 1392.6546 1415.1540 1433.2062 1435.3667 1450.9486 1454.8359 1459.9395 1460.3203 1462.6012 1464.8147 1465.0916 1467.1756 1469.6706 1473.1097 1476.6248 1478.7222 1479.4645 1498.3947 1582.4578 1619.9922 2836.6823 2846.6259 2933.3490 2952.3174 2955.5336 2960.0422 2962.5843 2964.5357 2966.0853 2966.7797 2972.4154 2979.2042 2979.3458 2980.5571 3013.2617 3017.4525 3022.1770 3025.6970 3030.1669 3034.5674 3036.0206 3040.0609 3041.7319 3049.6046 3052.8859 3095.3781 3121.3498 3130.0205 3135.6059 3157.7820 3162.0925
redmass: 4.1803 3.4991 3.9336 3.0829 3.6354 2.9621 2.7345 3.1597 3.3911 2.0569 2.9708 2.8810 2.0568 2.2279 2.3074 2.0436 1.5906 2.1033 3.3883 3.1433 2.8137 2.1740 3.1935 2.4857 3.3145 2.9053 3.0071 2.9664 2.9851 2.3263 2.5421 3.1112 2.4074 2.9220 4.3923 2.4368 6.8243 3.0114 4.1447 2.9114 3.9588 2.8841 2.3537 1.5278 1.3709 2.0639 1.6886 1.4907 2.2109 1.8323 2.9544 2.1509 2.3013 2.2298 1.5139 1.3395 1.9566 1.3472 7.6349 2.6121 2.7425 4.7798 2.0501 2.1612 1.6421 1.5666 1.6249 2.0814 2.0387 1.5204 1.2612 1.5375 2.2205 1.6038 1.8368 1.2545 2.2632 1.4119 1.5898 1.2346 1.5760 2.5019 1.6685 3.4265 1.3937 1.4385 1.2807 1.2157 1.2623 1.3124 1.3593 1.3379 1.2852 1.3421 1.3575 1.4008 1.4242 1.4176 1.4409 1.4345 1.5045 1.5184 1.6176 1.3615 1.3640 2.6916 2.7364 1.1723 1.1798 1.0942 1.0535 1.0916 1.0879 1.0883 1.0939 1.0505 1.0811 1.0868 1.0786 1.0925 1.0606 1.0878 2.3948 7.0051 6.3268 1.0707 1.0695 1.0344 1.0805 1.0331 1.0794 1.0612 1.0647 1.0632 1.0712 1.0692 1.0614 1.0637 1.0673 1.1006 1.0878 1.0961 1.0998 1.0932 1.0919 1.1005 1.1030 1.1038 1.1039 1.1002 1.0987 1.0990 1.0888 1.0874 1.0949 1.0957
irintensity: 0.2940 0.6050 0.4928 1.0277 1.2390 1.5391 1.4707 1.2995 3.7610 1.7927 2.2015 0.7499 2.9158 4.0776 0.9482 2.2362 0.6197 1.7432 1.5409 1.3447 1.0450 0.9594 2.7364 0.9646 0.5290 6.7542 0.5512 0.0859 0.8335 1.2111 6.3910 3.8107 3.0287 14.3642 30.4103 4.7605 0.4023 8.2988 1.1334 3.5650 14.8684 5.1470 7.8421 0.5271 13.4155 1.1281 24.0910 6.3292 36.0661 19.6832 6.9827 9.7851 4.3354 3.6407 4.6835 1.6690 1.2174 4.3288 48.8152 26.5680 6.8939 115.6697 2.8703 12.5497 0.9977 12.5669 8.6887 18.4354 10.4318 6.9649 0.2280 1.6337 1.8465 0.3067 9.3674 6.5753 18.9466 0.8280 2.6926 66.7413 19.6202 2.2390 8.5406 174.2818 5.7084 2.1701 0.6984 4.8777 1.7876 3.5938 2.5910 11.6169 1.7037 10.4065 5.2799 4.9532 1.7399 5.3784 0.3874 0.0066 1.0641 9.4162 14.8063 10.7832 4.6899 5.5195 2.8283 3.3033 11.2384 4.9982 4.6090 1.2204 11.3562 7.4079 15.9334 13.2160 3.3919 25.3249 54.8330 4.1094 4.8766 6.7802 102.7714 10.1295 57.6744 41.5956 157.7609 78.4338 1.1132 75.2196 17.9387 33.5335 45.2090 32.0810 17.5573 33.0719 33.5614 64.0344 38.8141 52.5553 62.6252 73.1159 41.1532 76.4054 11.5083 81.4611 25.8191 50.7068 117.7647 48.0263 35.9170 29.6067 2.9986 5.4814 16.5359 6.2893
temp: 298.150 k
press: 1.00000 atm
elementType: 8 8 7 6 6 6 6 6 6 6 6 6 6 6 6 6 6 6 6 6 6 6 6 1 1 1 1 1 1 1 1 1 1 1 1 1 1 1 1 1 1 1 1 1 1 1 1 1 1 1 1 1 1 1
symmnumber: 1
zpe: 1243035.5 jmol-1
zpe.correction: 0.473447 hartree
zpe.thermalcorrener: 0.496465 hartree
zpe.thermalcorrenthalpy: 0.497409 hartree
zpe.thermalcorrgfe: 0.421116 hartree
zpe.sumelectzpe: -984.095844 hartree
zpe.sumelectthermal: -984.072826 hartree
zpe.sumelectthermalent: -984.071882 hartree
zpe.sumelectthermalfe: -984.148175 hartree
dipole: -0.4405 0.0179 -0.2341
dipole: 0.4992
quadrupole: -120.8371 -144.1740 -138.1068
quadrupole: -6.3586 0.7996 -1.9671
quadrupole: 13.5355 -9.8014 -3.7341 -6.3586 0.7996 -1.9671
hfenergy: -984.5692911 hartree
pointgroup: C01 [X(C20H31N1O2)]
dipole: -0.1728165 -0.0705905 0.0609985 debye
polarizability: 263.1316559|9.176502|192.1441223|-10.8574322|12.3852415|222.4090653 unknown
InChI: InChI=1S/C20H31NO2/c1-22-17-12-10-16(11-13-17)20(23-2)18-8-4-5-9-19(18)21-14-6-3-7-15-21/h10-13,18-20H,3-9,14-15H2,1-2H3
charge 0 multiplicity 1
54 atoms
O  -0.340393 1.031275 -2.785438
O  -4.383069 0.441599 2.281953
N  2.298431 0.074817 0.432077
C  1.562472 -1.057374 -0.21407
C  0.871235 -0.638394 -1.543816
C  2.426591 -2.335091 -0.443845
C  0.021164 -1.811152 -2.098054
C  1.583887 -3.501066 -1.011741
C  0.874726 -3.080059 -2.318971
C  0.061447 0.682443 -1.404486
C  3.482794 0.584595 -0.302252
C  2.604518 -0.156982 1.864963
C  3.961798 1.92083 0.305982
C  3.061429 1.150862 2.547333
C  4.279123 1.753209 1.80957
C  -1.142488 0.613752 -0.46396
C  -1.004849 0.977994 0.902263
C  -2.413795 0.190967 -0.918471
C  -0.781875 2.41991 -2.912911
C  -2.095008 0.907078 1.788756
C  -3.523207 0.120036 -0.044909
C  -3.359595 0.473916 1.317431
C  -5.708618 0.003616 1.843231
H  0.753582 -1.326563 0.499444
H  1.65306 -0.419611 -2.30256
H  2.902559 -2.640436 0.508451
H  3.244425 -2.102189 -1.156018
H  -0.452083 -1.488598 -3.043453
H  -0.795379 -2.042055 -1.384677
H  0.820412 -3.800953 -0.263738
H  2.226976 -4.386081 -1.185483
H  1.636884 -2.881968 -3.101321
H  0.237711 -3.904783 -2.694078
H  0.757459 1.458574 -1.020214
H  3.212481 0.730117 -1.363691
H  4.3347 -0.143001 -0.274959
H  3.408707 -0.926167 2.003485
H  1.692062 -0.546105 2.355879
H  3.16327 2.678069 0.179037
H  4.854679 2.277287 -0.243565
H  3.308154 0.948212 3.60771
H  2.223992 1.87615 2.530405
H  5.150105 1.074797 1.926429
H  4.564421 2.723699 2.258134
H  -0.024795 1.313427 1.262248
H  -2.535559 -0.065845 -1.976822
H  -1.681687 2.623752 -2.297989
H  -1.021039 2.568808 -3.978445
H  0.02243 3.125164 -2.612499
H  -1.996081 1.18726 2.842162
H  -4.49338 -0.206309 -0.43233
H  -6.339331 0.048572 2.743441
H  -5.684263 -1.034284 1.456612
H  -6.120597 0.676877 1.065872
