program: Gaussian 09
title: 000203034
version: EM64L-G09RevD.01
frameworkgroup: C1[X(C18H23N3O)]
method: RPBEPBE
basis: SDD
operation: Freq
keyword: #p
keyword: freq=noraman
keyword: PBEPBE/SDD
title: #p freq=noraman PBEPBE/SDD
converged: YES YES NO NO
title: Mulliken charges:
elementType: O N N N C C C C C C C C C C C C C C C C C C H H H H H H H H H H H H H H H H H H H H H H H
charge: -0.306712 -0.095706 -0.148872 -0.108004 -0.340954 -0.360182 -0.380491 -0.399059 -0.388732 -0.094839 0.248771 0.370075 -0.322243 -0.416593 -0.392147 -0.515190 -0.180537 -0.218387 -0.232694 -0.346741 -0.246593 -0.219164 0.203362 0.188864 0.197972 0.217639 0.200681 0.217608 0.209380 0.273695 0.202655 0.234538 0.191357 0.214680 0.280658 0.261904 0.205238 0.238838 0.198582 0.229029 0.221914 0.222104 0.232071 0.224420 0.227809
chargesum: 0.00000
title: Mulliken charges with hydrogens summed into heavy atoms:
elementType: O N N N C C C C C C C C C C C C C C C C C C
charge: -0.306712 -0.095706 -0.148872 -0.108004 0.051272 0.055429 0.037798 0.084017 0.048460 0.096517 0.248771 0.370075 -0.107563 -0.135935 -0.130243 0.127468 0.048492 0.003527 -0.010591 -0.114670 -0.022172 0.008644
polarizability: 3.14480537e+02 -5.21698042e+00 2.02042958e+02 7.91051712e+00 -9.60714957e+00 1.47283943e+02
1716.lowfreq: -5.5192 -0.0005 0.0005 0.0007 6.5516 7.8708 11.4215 17.5057 29.5509
frequency: 10.7907 17.3446 29.1924 35.0962 63.2447 68.4179 88.9680 122.2688 136.9137 154.3387 167.6124 192.3373 207.9750 246.9791 261.7358 279.4189 323.7968 332.0958 352.4940 378.8644 403.0474 409.0963 410.2347 436.3490 471.1862 475.5442 508.9276 523.6997 553.0803 606.0512 613.8714 616.7348 628.5638 707.2839 726.8929 730.0177 758.1960 765.2391 768.4763 788.6784 842.4311 846.6597 863.2069 907.5741 924.9353 931.3974 942.5381 943.5312 953.8072 975.1451 976.1724 985.0617 990.7889 996.7628 1001.5628 1027.4646 1035.6416 1042.4944 1050.2120 1055.6026 1061.7297 1082.2391 1089.3345 1097.1831 1114.8676 1133.8810 1141.2297 1150.0225 1170.1702 1170.9709 1181.8355 1184.2178 1199.5506 1204.2979 1236.3865 1247.1706 1282.9180 1283.9782 1294.7598 1301.9757 1309.8343 1325.0164 1330.0094 1336.4318 1344.9022 1360.3906 1363.9154 1381.2691 1386.4919 1392.5174 1425.0056 1432.9257 1438.0227 1451.8244 1457.1661 1457.7822 1463.0435 1466.9799 1471.5149 1474.1338 1482.3742 1486.0161 1551.6443 1590.2975 1597.9999 1614.1049 2853.1593 2871.1763 2885.0445 2923.0319 2929.2721 2943.9060 2949.9180 3000.3176 3023.2246 3041.0454 3055.6350 3088.8299 3096.8567 3101.4966 3118.1851 3119.2719 3128.4122 3134.6838 3141.6157 3155.9605 3164.6231 3176.6438 3176.7569
redmass: 5.0790 4.0796 4.0551 4.4605 3.4246 4.2219 2.9172 3.2169 3.7153 1.8743 3.1527 2.3151 4.0310 3.3073 2.0328 2.8670 3.8336 2.6780 4.0009 2.6600 2.8872 3.1810 2.5599 4.1861 3.8287 2.6297 2.7952 3.3353 5.2034 4.0837 4.6162 6.3417 2.5481 1.9587 1.7080 4.4982 1.7479 3.2470 2.6380 2.8992 1.5372 1.4145 1.2454 3.1076 2.9255 1.9930 2.0011 1.7086 3.8043 2.5426 1.3290 1.6216 3.4724 1.5009 2.1328 2.3733 2.9346 2.4751 2.2292 2.1736 2.4327 1.6794 1.9233 1.9656 1.2797 2.5477 2.6120 1.5065 1.0572 1.1451 1.4644 1.3259 1.6498 1.2511 1.6228 1.4535 1.4054 1.3292 1.2952 2.0578 1.4518 1.3659 1.6420 1.7813 1.5344 1.4120 1.3188 4.5340 1.6862 2.0446 2.1611 1.5376 1.4564 1.0789 1.1256 1.0733 1.1194 1.1275 1.1380 1.0695 2.0800 2.7150 5.2106 6.2760 6.0502 6.0414 1.0705 1.0699 1.0697 1.0632 1.0522 1.0696 1.0695 1.1023 1.0887 1.0911 1.0899 1.0907 1.0920 1.0971 1.0845 1.0893 1.0887 1.0885 1.0942 1.0991 1.0926 1.0953 1.1001
irintensity: 0.0265 0.0305 0.4839 0.5223 0.6686 0.7203 3.8501 1.0974 6.2574 0.2361 1.5561 0.2643 1.5733 5.5846 0.9088 7.8698 0.8349 2.1791 4.4938 2.0091 0.2373 2.8265 6.5179 7.1515 5.3921 0.6224 8.7057 18.6766 7.9476 2.5227 1.6975 0.1153 4.1695 49.0429 31.8501 1.1243 42.6223 29.5508 39.3774 7.2145 0.0700 0.1200 1.2902 15.4105 1.4310 18.7006 2.8621 2.2459 69.4828 8.3871 0.1335 1.1355 0.1700 18.8871 56.0521 26.4900 17.2170 6.7884 49.6864 20.2693 36.5441 10.7032 0.8494 0.8353 1.7108 62.2538 14.5342 16.3880 0.0466 6.0758 2.5437 7.2076 3.9913 1.2128 16.8837 150.9994 15.2363 20.6559 18.3716 13.1049 16.3551 18.4079 5.8197 65.8339 4.6508 2.7237 17.5790 0.1996 4.1979 0.2248 34.5189 4.3724 8.5150 3.2136 64.0120 1.9072 62.5844 21.4678 9.7068 15.8357 33.1166 206.8546 45.0466 0.7581 405.3276 8.4289 57.9151 43.0245 142.9262 27.8638 92.5504 41.2526 110.6670 71.7462 57.4951 35.4598 27.7883 23.2801 9.7215 33.7307 0.0468 30.9118 10.8275 11.9444 24.6509 34.1242 34.2843 12.2023 12.5917
temp: 298.150 k
press: 1.00000 atm
elementType: 8 7 7 7 6 6 6 6 6 6 6 6 6 6 6 6 6 6 6 6 6 6 1 1 1 1 1 1 1 1 1 1 1 1 1 1 1 1 1 1 1 1 1 1 1
symmnumber: 1
zpe: 991485.6 jmol-1
zpe.correction: 0.377637 hartree
zpe.thermalcorrener: 0.397970 hartree
zpe.thermalcorrenthalpy: 0.398914 hartree
zpe.thermalcorrgfe: 0.325116 hartree
zpe.sumelectzpe: -937.516285 hartree
zpe.sumelectthermal: -937.495951 hartree
zpe.sumelectthermalent: -937.495007 hartree
zpe.sumelectthermalfe: -937.568806 hartree
dipole: -1.0466 2.4893 -1.3651
dipole: 3.0258
quadrupole: -135.2692 -121.5404 -131.5697
quadrupole: -3.1821 5.0268 -3.7730
quadrupole: -5.8094 7.9194 -2.1100 -3.1821 5.0268 -3.7730
hfenergy: -937.8939215 hartree
pointgroup: C01 [X(C18H23N3O1)]
dipole: 0.3445288 0.8334849 0.7769951 debye
polarizability: 313.2495632|9.8612801|194.554517|11.1039077|22.5967466|156.0033573 unknown
InChI: InChI=1S/C18H23N3O/c1-22-17(16-7-3-2-4-8-16)15-20-11-13-21(14-12-20)18-9-5-6-10-19-18/h2-10,17H,11-15H2,1H3
charge 0 multiplicity 1
45 atoms
O  -3.828984 2.082248 0.081439
N  -0.428116 0.540601 -0.324454
N  2.382977 0.097576 0.130525
N  4.414029 -0.400077 -0.949889
C  0.323565 1.371738 0.643751
C  0.46029 0.114638 -1.437877
C  1.529387 0.596828 1.218329
C  1.6551 -0.683995 -0.890949
C  -1.681597 1.187399 -0.780664
C  -2.853278 0.989472 0.234041
C  3.778407 0.137101 0.147751
C  -3.583421 -0.336238 0.031043
C  4.532189 0.705733 1.228421
C  -4.939531 -0.371453 -0.375113
C  -2.890428 -1.557286 0.240984
C  -3.458014 3.294156 0.806497
C  5.934697 0.732489 1.138526
C  -5.593163 -1.610218 -0.57043
C  -3.546269 -2.793017 0.045325
C  5.771714 -0.363108 -1.005776
C  -4.90124 -2.825085 -0.360773
C  6.587774 0.195125 0.000953
H  -0.343976 1.65878 1.477867
H  0.696111 2.313992 0.165327
H  0.84171 0.991264 -2.018686
H  -0.121784 -0.527134 -2.123999
H  2.096849 1.273624 1.875748
H  1.153657 -0.250664 1.832156
H  1.277472 -1.625222 -0.436194
H  2.368897 -0.935823 -1.689634
H  -1.542282 2.282704 -0.954142
H  -1.979601 0.743265 -1.746303
H  -2.43557 1.017687 1.266414
H  4.044773 1.103416 2.121932
H  -5.467469 0.573938 -0.524768
H  -1.836732 -1.525711 0.540593
H  -3.395944 3.105446 1.899436
H  -4.257746 4.024923 0.607365
H  -2.490047 3.715269 0.460054
H  6.518128 1.164157 1.959663
H  -6.643787 -1.625509 -0.883215
H  -3.001937 -3.729772 0.21281
H  6.215344 -0.807169 -1.905474
H  -5.410896 -3.784142 -0.508748
H  7.676738 0.199357 -0.09616
