program: Gaussian 09
title: 000203003
version: EM64L-G09RevD.01
frameworkgroup: C1[X(C12H16NO)]
method: RPBEPBE
basis: SDD
operation: Freq
keyword: #p
keyword: freq=noraman
keyword: PBEPBE/SDD
title: #p freq=noraman PBEPBE/SDD
converged: YES YES NO NO
title: Mulliken charges:
elementType: O N C C C C C C C C C C C C H H H H H H H H H H H H H H H H
charge: -0.222517 -0.057382 -0.142995 -0.476335 -0.421267 -0.506669 -0.591333 0.171038 0.494405 -0.280058 -0.341733 -0.161601 -0.150164 -0.582658 0.259750 0.245516 0.228975 0.227505 0.251701 0.274117 0.265078 0.262478 0.243854 0.340461 0.275733 0.289162 0.284105 0.252983 0.284507 0.283346
chargesum: 1.00000
title: Mulliken charges with hydrogens summed into heavy atoms:
elementType: O N C C C C C C C C C C C C
charge: -0.222517 -0.057382 0.116755 -0.001844 0.057939 0.032526 -0.085001 0.171038 0.494405 0.060402 -0.066001 0.127561 0.133942 0.238177
polarizability: 1.87224312e+02 5.86531781e+00 1.27342219e+02 6.51108007e+00 4.25479603e-01 8.29977777e+01
1716.lowfreq: -12.5001 -8.3160 -0.0007 -0.0001 0.0005 3.4939 30.7376 35.4081 49.6857
frequency: 30.2955 35.3974 49.6664 87.3731 98.1468 151.1041 194.4186 203.1823 275.0811 298.6947 320.1115 390.0621 401.4777 447.9883 482.2018 520.4220 547.3341 584.4839 604.9581 662.5173 694.4101 726.7550 751.5109 803.1226 828.2186 848.8417 875.3010 881.6386 915.5891 934.2836 942.8773 978.1229 1013.4604 1033.1708 1040.6615 1050.8598 1055.4915 1083.5905 1122.5049 1124.3165 1152.5952 1154.8526 1168.3585 1176.7124 1185.0158 1210.4628 1219.6304 1238.8161 1261.7791 1274.4897 1283.9979 1305.0876 1315.8735 1322.5127 1353.8229 1366.9322 1423.9391 1433.3102 1451.9513 1460.1524 1469.5778 1475.4370 1479.1855 1483.5092 1505.6626 1551.7001 1635.5503 1640.4012 2955.1408 2986.4127 2993.3843 2997.5377 3017.0140 3023.8532 3058.7827 3069.1793 3078.1660 3096.4066 3099.6151 3127.0120 3148.1124 3174.8077 3188.9963 3201.1452
redmass: 1.1037 2.9530 4.0591 3.1018 4.2085 3.1271 4.3064 2.5348 3.2124 2.4982 2.9950 2.7080 2.7856 3.6707 3.7771 4.2116 2.3311 2.8177 2.8968 6.4117 3.2778 3.5206 4.1288 1.7833 3.1167 1.7052 1.5424 1.3809 2.0810 1.7698 1.6284 1.3822 2.0745 2.5202 1.2864 3.0353 1.6537 2.4222 1.6368 1.4516 1.4105 2.1700 1.5638 4.1146 1.3034 1.3367 1.4177 1.7329 1.2484 1.4391 1.3165 1.4047 1.4315 1.5561 1.2708 3.2025 1.0747 1.1995 1.5562 1.4046 1.0391 1.0873 1.2933 1.0932 1.9244 5.0346 5.2464 11.6437 1.0813 1.0635 1.0660 1.0651 1.0652 1.0338 1.0983 1.0945 1.0994 1.1026 1.0976 1.1043 1.1034 1.0915 1.0960 1.0994
irintensity: 0.9617 0.6045 2.6108 2.8600 4.1313 3.2697 7.6592 0.2962 1.9266 3.1543 0.2171 0.0550 0.2286 11.7722 11.4535 6.9478 5.1688 23.8871 2.5292 5.1426 4.6144 1.0931 2.8885 18.7132 12.3616 27.7544 1.3356 16.5577 3.3543 3.7256 15.3589 0.4037 34.4666 3.2360 4.2867 3.1473 2.4960 4.8992 3.9455 4.6425 18.1076 46.4531 53.9301 37.5356 1.4981 1.8408 1.2781 0.7248 4.0326 2.2489 7.2968 2.9690 2.6680 1.1331 15.7479 1.3847 28.9892 16.1101 7.0622 10.3637 25.5711 9.9321 53.1187 6.8983 45.4686 17.2525 140.4258 157.5617 3.8707 5.7332 7.7790 25.4410 25.1615 3.5384 9.3186 3.3275 21.2420 22.5782 134.9382 1.6660 2.3970 0.0401 2.8285 0.2336
temp: 298.150 k
press: 1.00000 atm
elementType: 8 7 6 6 6 6 6 6 6 6 6 6 6 6 1 1 1 1 1 1 1 1 1 1 1 1 1 1 1 1
symmnumber: 1
zpe: 671742.2 jmol-1
zpe.correction: 0.255853 hartree
zpe.thermalcorrener: 0.269129 hartree
zpe.thermalcorrenthalpy: 0.270073 hartree
zpe.thermalcorrgfe: 0.214231 hartree
zpe.sumelectzpe: -595.581426 hartree
zpe.sumelectthermal: -595.568150 hartree
zpe.sumelectthermalent: -595.567206 hartree
zpe.sumelectthermalfe: -595.623048 hartree
dipole: 8.1846 -2.3915 1.2171
dipole: 8.6133
quadrupole: -10.4418 -73.1307 -79.8791
quadrupole: 4.6582 3.2793 3.0324
quadrupole: 44.0421 -18.6468 -25.3952 4.6582 3.2793 3.0324
hfenergy: -595.8372791 hartree
pointgroup: C01 [X(C12H16N1O1)]
dipole: -3.2981186 0.7315122 -0.2660234 debye
polarizability: 186.6896689|8.7396139|112.5140482|-3.9548642|-21.6826674|98.3605921 unknown
InChI: InChI=1S/C12H16NO/c1-13-7-5-10(6-8-13)9-11-3-2-4-12(11)14/h5-8,11H,2-4,9H2,1H3
charge 1 multiplicity 1
30 atoms
O  1.600394 -1.584494 0.845129
N  -3.59334 -0.24208 0.232212
C  1.543069 0.75846 -0.007515
C  2.768407 1.575061 -0.504359
C  3.86586 1.284081 0.558612
C  3.668692 -0.21376 0.901954
C  0.478285 0.464874 -1.110808
C  2.194462 -0.496913 0.627108
C  -0.93624 0.223701 -0.622932
C  -1.249651 -0.831459 0.284403
C  -2.016254 1.030458 -1.074582
C  -2.567662 -1.043668 0.690973
C  -3.325034 0.785554 -0.64038
C  -4.990391 -0.509219 0.693324
H  1.072361 1.323802 0.826928
H  2.545927 2.650572 -0.604654
H  3.090149 1.203132 -1.49707
H  3.701104 1.909985 1.454894
H  4.878115 1.504348 0.184093
H  3.942319 -0.498985 1.932701
H  4.265903 -0.866389 0.233121
H  0.809641 -0.428775 -1.677722
H  0.477129 1.311227 -1.820453
H  -0.44219 -1.475128 0.657757
H  -1.846957 1.854712 -1.772723
H  -2.847175 -1.845582 1.378373
H  -4.173931 1.387227 -0.971207
H  -5.675701 0.217099 0.233884
H  -5.290032 -1.526404 0.39485
H  -5.043561 -0.41204 1.789289
