program: Gaussian 09
title: 000202995
version: EM64L-G09RevD.01
frameworkgroup: C1[X(C17H23NO)]
method: RPBEPBE
basis: SDD
operation: Freq
keyword: #p
keyword: freq=noraman
keyword: PBEPBE/SDD
title: #p freq=noraman PBEPBE/SDD
converged: YES YES NO NO
title: Mulliken charges:
elementType: O N C C C C C C C C C C C C C C C C C H H H H H H H H H H H H H H H H H H H H H H H
charge: -0.269171 -0.089462 -0.101321 -0.259310 -0.063422 -0.575125 -0.500734 -0.460647 -0.378602 0.282211 -0.413507 -0.398690 -0.574944 0.311923 -0.519455 -0.422691 0.321085 -0.387371 -0.536529 0.230756 0.233838 0.238039 0.221398 0.235256 0.206236 0.210486 0.198759 0.210229 0.212531 0.173116 0.194884 0.212541 0.207923 0.192439 0.218486 0.220354 0.275642 0.228576 0.237965 0.241881 0.217592 0.216831
chargesum: 0.00000
title: Mulliken charges with hydrogens summed into heavy atoms:
elementType: O N C C C C C C C C C C C C C C C C C
charge: -0.269171 -0.089462 0.129435 -0.025471 0.174617 -0.118471 -0.084012 -0.051659 0.007045 0.282211 -0.006081 0.001673 -0.136104 0.311923 -0.243813 -0.194115 0.321085 -0.149407 0.139776
polarizability: 2.26954695e+02 -8.39657925e+00 1.92810687e+02 1.05500770e+01 8.87627114e+00 1.38577568e+02
1716.lowfreq: -13.4253 -10.4075 -3.0897 -0.0007 -0.0007 -0.0006 32.2678 54.6608 83.0019
frequency: 31.4445 54.5857 82.9727 89.8038 117.0045 161.5873 181.8600 217.3375 220.4002 240.5947 253.5809 278.3304 302.3254 331.8434 347.9257 376.9440 399.5338 419.8726 434.1376 458.9637 495.4871 512.5550 546.4284 556.9937 598.5679 604.7588 641.6287 682.0030 700.3191 721.5255 741.9681 783.2342 802.0990 806.9999 818.6333 855.9079 861.7273 879.9012 886.9658 893.9156 906.5674 929.1159 934.2183 954.4625 969.0873 991.9838 1002.4682 1010.8598 1048.9475 1054.0488 1073.9728 1079.2848 1097.5716 1111.6595 1114.0317 1123.1767 1133.9481 1143.2489 1155.7948 1169.9816 1170.7581 1182.6321 1195.5036 1203.3589 1213.1770 1223.3034 1244.2205 1258.7198 1259.6760 1273.2730 1282.2779 1297.7401 1307.6570 1316.9015 1328.1939 1334.1541 1341.2479 1342.3839 1343.8592 1359.1683 1362.8577 1375.5283 1384.1754 1418.8479 1436.6405 1449.4768 1454.2909 1460.2995 1464.1778 1465.4119 1467.9153 1474.0147 1479.6903 1490.5342 1493.9562 1579.1403 1623.8145 2853.2306 2951.9813 2952.7652 2969.6286 2970.1296 2971.9204 2983.6874 2984.6274 2988.1261 2994.3112 3004.9782 3014.3320 3020.7548 3030.6900 3031.1256 3037.3246 3038.5216 3051.2620 3054.9897 3112.9359 3119.0863 3158.0874 3159.9813
redmass: 3.4222 3.4627 3.3651 3.5868 2.7879 2.8533 3.3728 2.6201 1.8097 2.0268 2.1687 2.7506 3.2902 1.9085 2.7397 2.2954 4.1420 3.1867 3.4141 2.3563 3.5737 3.2056 4.0416 3.3618 3.0339 3.0254 3.0685 4.0484 3.5791 3.3764 3.1295 2.9040 1.7772 1.5765 2.9440 2.6877 2.3497 2.7203 2.1482 1.6308 1.9363 1.6808 1.6802 2.0082 2.1420 2.4672 2.8161 3.2208 2.7367 1.7130 2.1507 2.0532 1.4677 1.2603 1.7662 1.9381 1.6768 1.5737 1.6903 1.3089 1.4189 1.5136 1.4130 1.3578 1.9728 1.4908 2.9022 1.3683 1.2893 1.2593 1.4745 1.3511 1.4937 1.3712 1.3919 1.2849 1.4527 1.6087 1.6976 1.4138 1.4114 1.4018 5.8856 3.4623 1.2172 1.0900 1.1143 1.0873 1.0917 1.0504 1.0923 1.0770 1.1001 1.1404 2.2450 7.2969 6.9954 1.0699 1.0573 1.0417 1.0622 1.0673 1.0715 1.0732 1.0669 1.0743 1.0689 1.0788 1.0876 1.0921 1.0971 1.1026 1.1036 1.1011 1.1036 1.1032 1.0890 1.0988 1.0916 1.0933
irintensity: 0.2316 2.1804 1.3889 3.7691 0.6526 0.4465 1.2721 0.2028 0.7201 1.2430 0.4668 1.4034 2.6569 2.1768 3.7498 1.6384 1.4454 2.0307 3.3103 1.5907 4.2916 1.7907 4.6538 0.5953 7.0772 5.0138 1.5338 10.3832 0.9184 15.3005 0.7387 7.0093 22.3656 14.7539 8.5445 2.4975 10.8370 10.7747 8.2964 10.8714 4.5545 2.9651 1.0380 9.7600 3.5863 13.0886 29.7381 31.4235 14.7571 11.2865 5.0209 21.3709 2.9836 0.2249 5.6630 18.0570 0.5641 8.1663 2.9033 2.8893 7.2630 4.1479 50.9323 1.8377 4.2521 2.6262 94.9851 25.8350 12.5938 2.7353 19.1952 15.8381 6.3249 10.9670 0.5795 3.6587 3.9235 2.5557 3.5406 0.6614 1.6958 2.2076 7.4860 25.7260 3.7797 5.7720 5.5993 11.2348 3.8970 12.3278 13.4854 53.0971 17.9370 29.3744 72.2764 18.2744 60.4970 82.6949 48.7584 63.1226 27.8674 24.9051 11.6472 30.1223 29.1495 41.2459 47.8169 40.9444 64.5645 57.2311 31.2525 60.9759 53.7738 61.8648 36.6021 76.1088 23.9994 22.2427 5.5782 16.3246
temp: 298.150 k
press: 1.00000 atm
elementType: 8 7 6 6 6 6 6 6 6 6 6 6 6 6 6 6 6 6 6 1 1 1 1 1 1 1 1 1 1 1 1 1 1 1 1 1 1 1 1 1 1 1
symmnumber: 1
zpe: 958271.9 jmol-1
zpe.correction: 0.364986 hartree
zpe.thermalcorrener: 0.381388 hartree
zpe.thermalcorrenthalpy: 0.382332 hartree
zpe.thermalcorrgfe: 0.321397 hartree
zpe.sumelectzpe: -790.132149 hartree
zpe.sumelectthermal: -790.115748 hartree
zpe.sumelectthermalent: -790.114804 hartree
zpe.sumelectthermalfe: -790.175738 hartree
dipole: 0.0878 1.2603 0.4938
dipole: 1.3565
quadrupole: -96.4189 -112.9324 -113.5524
quadrupole: -1.5303 5.0795 0.2966
quadrupole: 11.2156 -5.2978 -5.9178 -1.5303 5.0795 0.2966
hfenergy: -790.4971357 hartree
pointgroup: C01 [X(C17H23N1O1)]
dipole: 0.0336693 0.5007516 0.1814653 debye
polarizability: 226.2892014|-8.4981746|193.3666526|12.889651|7.1072806|138.6870963 unknown
InChI: InChI=1S/C17H23NO/c1-19-15-8-7-12-5-6-13-10-14-4-2-3-9-18(14)17(13)16(12)11-15/h7-8,11,13-14,17H,2-6,9-10H2,1H3
charge 0 multiplicity 1
42 atoms
O  3.557901 -2.054829 -0.085397
N  -1.451667 -0.782184 -0.355058
C  -1.478153 1.621699 -0.824664
C  -0.637286 0.301302 -1.008039
C  -1.95122 -0.108772 0.89507
C  -2.328882 1.353594 0.462936
C  -0.608689 2.897471 -0.798251
C  -3.041237 -0.918576 1.625786
C  -2.540845 -1.264257 -1.25485
C  0.775092 0.363973 -0.41055
C  -4.148269 -1.435405 0.679138
C  -3.505916 -2.197546 -0.500784
C  0.488307 2.820843 0.283551
C  1.32023 1.550288 0.161431
C  1.559915 -0.80804 -0.464248
C  2.64948 1.518417 0.644677
C  2.882838 -0.823681 0.029188
C  3.443103 0.352157 0.587818
C  4.930438 -2.117917 0.4156
H  -2.165012 1.698207 -1.689742
H  -0.540028 0.051399 -2.082597
H  -1.072818 -0.037827 1.567361
H  -2.099861 2.072956 1.27042
H  -3.409627 1.441609 0.246093
H  -1.249044 3.78514 -0.62918
H  -0.129498 3.029003 -1.789561
H  -3.47168 -0.29374 2.432419
H  -2.562083 -1.790009 2.114047
H  -2.064791 -1.798459 -2.099018
H  -3.142159 -0.426368 -1.691815
H  -4.747012 -0.58915 0.284097
H  -4.846112 -2.08793 1.237258
H  -2.943126 -3.071615 -0.119022
H  -4.279008 -2.571071 -1.199242
H  0.013501 2.856993 1.286874
H  1.144529 3.710176 0.22583
H  1.134056 -1.730603 -0.870479
H  3.077748 2.430659 1.079492
H  4.468375 0.372352 0.969368
H  5.256752 -3.15262 0.232748
H  4.976943 -1.899709 1.501031
H  5.594316 -1.417331 -0.128937
