program: Gaussian 09
title: 000202972
version: EM64L-G09RevD.01
frameworkgroup: C1[X(C13H15ClN2)]
method: RPBEPBE
basis: SDD
operation: Freq
keyword: #p
keyword: freq=noraman
keyword: PBEPBE/SDD
title: #p freq=noraman PBEPBE/SDD
converged: YES YES NO NO
title: Mulliken charges:
elementType: Cl N N C C C C C C C C C C C C C H H H H H H H H H H H H H H H
charge: -0.092992 -0.306261 -0.474080 0.214098 0.229434 -0.484505 0.149629 -0.500328 0.152059 -0.740798 -0.739141 0.208941 -0.359492 -0.353632 -0.143137 -0.228022 0.212482 0.194082 0.206602 0.228621 0.249103 0.220589 0.203405 0.217571 0.221790 0.208566 0.271910 0.299892 0.250209 0.233890 0.249516
chargesum: 0.00000
title: Mulliken charges with hydrogens summed into heavy atoms:
elementType: Cl N N C C C C C C C C C C C C C
charge: -0.092992 -0.034351 -0.174188 0.214098 0.229434 -0.077941 0.149629 -0.065105 0.152059 -0.067701 -0.091214 0.208941 -0.109284 -0.119742 -0.143137 0.021494
polarizability: 2.27639067e+02 8.74239874e+00 1.68030545e+02 -1.44927899e+00 -1.85278358e-01 9.13517852e+01
1716.lowfreq: -6.6117 0.0012 0.0013 0.0018 7.8665 10.4838 50.8485 90.9448 114.6709
frequency: 50.8000 90.9379 114.6688 126.3399 183.3753 206.3516 234.7017 243.5678 254.5762 265.4909 296.4589 330.4489 335.7674 345.8808 364.4506 420.5169 429.6413 447.4512 480.6697 494.2797 524.8283 541.5537 579.5090 585.6117 643.2751 668.3585 697.7949 749.1938 752.5802 791.3559 842.1187 846.9681 867.5071 891.6467 923.8181 932.9923 942.6994 963.7894 986.1745 1008.0981 1026.6000 1051.5901 1077.2477 1127.7947 1134.9840 1162.2692 1181.5311 1211.3982 1213.9303 1226.1261 1248.1263 1259.7677 1285.2681 1305.6869 1317.7617 1370.5115 1376.6396 1395.6722 1401.6738 1429.9200 1449.6639 1450.1355 1456.5628 1467.2577 1468.0543 1472.4672 1476.8488 1482.0716 1491.0094 1567.3119 1587.9588 1629.1334 2821.2140 2859.3715 2970.9096 2976.8347 2986.9718 3037.0208 3063.5444 3068.9539 3085.8110 3089.5937 3137.6588 3175.0128 3178.4132 3475.6521 3606.8041
redmass: 4.1441 3.4706 4.1501 5.2431 3.9620 1.3356 2.4427 2.2718 1.6545 1.6977 4.0487 4.4476 3.0657 3.2214 2.8476 3.3992 3.6668 3.3785 1.6438 1.5712 3.0850 3.9438 3.3067 2.8202 4.4908 5.1499 6.4573 3.5841 3.7015 1.5449 4.3276 2.9426 1.4832 2.1752 1.3301 1.4821 3.0434 1.9209 1.8484 1.6080 1.7834 2.1558 2.5144 1.4239 2.6486 2.3422 1.7232 2.9376 1.8914 1.3397 1.6978 1.3831 1.8584 2.4799 1.9403 1.3031 1.4367 1.2773 3.3012 2.0002 1.9727 3.2267 1.1765 1.0622 1.1030 1.1704 1.7782 1.3021 1.1974 7.0251 7.1542 7.0650 1.0714 1.0702 1.0359 1.0365 1.0850 1.0900 1.0988 1.0982 1.0991 1.0995 1.0900 1.0947 1.0928 1.0756 1.0804
irintensity: 0.1130 0.5619 2.3076 1.0582 0.6641 0.1801 0.1006 0.8072 1.8259 0.5394 0.6752 1.5198 1.1777 0.6635 3.5488 3.6012 7.2178 39.6550 11.3612 104.8912 5.0683 11.2973 40.5229 25.9519 19.4952 1.4745 18.8683 16.6630 21.3660 53.2300 7.0035 10.8062 17.2458 2.8880 0.5055 1.2777 16.8368 1.1076 8.1961 5.8040 1.7621 24.6912 29.1456 8.2834 20.9522 9.0596 1.9993 11.5343 21.9088 2.8086 1.2894 4.8746 11.2245 22.5594 6.3465 23.2421 17.8504 19.2223 43.9479 10.5900 42.1163 1.5364 7.0688 3.5854 0.5906 16.7869 31.6498 27.9130 3.6719 14.0478 24.3658 4.0866 122.1720 109.8176 31.5821 39.2146 41.0144 32.4335 9.4503 88.7144 21.5071 24.7699 10.4268 6.8807 0.5063 0.7040 52.1964
temp: 298.150 k
press: 1.00000 atm
elementType: 17 7 7 6 6 6 6 6 6 6 6 6 6 6 6 6 1 1 1 1 1 1 1 1 1 1 1 1 1 1 1
symmnumber: 1
zpe: 662689.2 jmol-1
zpe.correction: 0.252405 hartree
zpe.thermalcorrener: 0.266779 hartree
zpe.thermalcorrenthalpy: 0.267723 hartree
zpe.thermalcorrgfe: 0.211968 hartree
zpe.sumelectzpe: -1072.783612 hartree
zpe.sumelectthermal: -1072.769238 hartree
zpe.sumelectthermalent: -1072.768294 hartree
zpe.sumelectthermalfe: -1072.824049 hartree
dipole: 4.6383 3.2444 -0.8497
dipole: 5.7238
quadrupole: -99.7769 -86.3920 -107.8249
quadrupole: -1.7436 -2.7746 0.3998
quadrupole: -1.7789 11.6059 -9.8270 -1.7436 -2.7746 0.3998
hfenergy: -1073.0360169 hartree
pointgroup: C01 [X(C13H15Cl1N2)]
dipole: -1.669543 1.4711125 0.345746 debye
polarizability: 224.9372995|-15.1476686|170.7186338|-1.8285857|0.7766263|91.3654641 unknown
InChI: InChI=1S/C13H15ClN2/c1-13(2)7-15-6-11-12(13)9-5-8(14)3-4-10(9)16-11/h3-5,15-16H,6-7H2,1-2H3
charge 0 multiplicity 1
31 atoms
Cl 4.348946 -1.822533 -0.073981
N  -3.497852 0.542187 -0.34057
N  -0.138219 2.12946 0.071433
C  -1.764871 -1.243451 0.051342
C  -0.79702 -0.065443 0.061428
C  -3.176095 -0.683435 0.42569
C  -1.237744 1.257915 0.06529
C  -2.672974 1.708639 0.043352
C  0.656559 -0.018871 0.041738
C  -1.813728 -1.884307 -1.36519
C  -1.385383 -2.315028 1.109197
C  1.040553 1.374263 0.054368
C  1.680957 -1.005284 0.000605
C  2.386683 1.79267 0.03855
C  3.012079 -0.566074 -0.017541
C  3.389441 0.801162 0.002875
H  -3.939464 -1.447819 0.190254
H  -3.199097 -0.507314 1.531203
H  -2.948268 2.133134 1.04498
H  -2.81974 2.514754 -0.703439
H  -2.244898 -1.165917 -2.0837
H  -0.801725 -2.161399 -1.712288
H  -2.437207 -2.79947 -1.358963
H  -0.44377 -2.827949 0.847714
H  -1.260011 -1.864368 2.110618
H  -2.176702 -3.086676 1.170927
H  -4.501229 0.757346 -0.352599
H  -0.188874 3.145609 0.056457
H  1.451603 -2.073093 -0.021507
H  2.662872 2.852608 0.050093
H  4.44728 1.077084 -0.012034
