program: Gaussian 09
title: 000202914
version: EM64L-G09RevD.01
frameworkgroup: C1[X(C23H27NO)]
method: RPBEPBE
basis: SDD
operation: Freq
keyword: #p
keyword: freq=noraman
keyword: PBEPBE/SDD
title: #p freq=noraman PBEPBE/SDD
converged: YES YES NO NO
title: Mulliken charges:
elementType: O N C C C C C C C C C C C C C C C C C C C C C C C H H H H H H H H H H H H H H H H H H H H H H H H H H H
charge: -0.269933 -0.081566 -0.634914 -0.566480 0.006802 -0.476308 0.434000 0.393589 0.386532 0.395471 -0.462723 -0.479252 -0.470830 -0.474241 -0.265468 -0.363357 -0.360425 -0.369719 -0.242298 -0.238806 -0.238635 -0.235635 -0.392532 -0.386932 -0.398770 0.255729 0.238199 0.218041 0.240758 0.231566 0.240598 0.244487 0.239161 0.240996 0.200950 0.186030 0.196454 0.217729 0.172950 0.204117 0.213425 0.167088 0.221965 0.224352 0.190615 0.204111 0.203176 0.191457 0.222074 0.224008 0.213409 0.188983
chargesum: 0.00000
title: Mulliken charges with hydrogens summed into heavy atoms:
elementType: O N C C C C C C C C C C C C C C C C C C C C C C C
charge: -0.269933 -0.081566 -0.379184 -0.328281 0.224843 -0.003984 0.434000 0.393589 0.386532 0.395471 -0.222125 -0.234766 -0.231669 -0.233245 0.121512 0.050826 0.016642 0.010795 -0.020333 -0.014453 -0.016561 -0.011627 0.002194 0.007701 0.003622
polarizability: 2.63612438e+02 2.19154069e+01 2.60297408e+02 -1.23409964e+01 5.05676890e+00 2.16389760e+02
1716.lowfreq: -9.1945 0.0008 0.0010 0.0011 0.9327 5.6430 15.9181 26.8675 32.4616
frequency: 15.0210 26.4319 32.1114 56.9000 68.0549 74.0110 119.0843 130.4094 143.3059 154.6468 168.3232 175.3719 225.2920 240.0271 267.4480 310.1022 321.4258 347.3967 358.8284 368.3191 374.8806 397.6867 427.8882 448.2340 449.3101 459.0683 474.1623 497.1030 508.2518 560.0930 570.2033 580.0863 606.3973 633.0943 643.4129 720.3248 750.8553 752.1534 755.9711 765.0517 771.1078 788.7698 799.3495 809.9377 815.3391 826.1045 843.3253 853.2504 856.8206 875.7051 887.3974 892.1255 904.3417 927.1778 943.0111 944.5407 958.8957 961.2915 982.6883 983.8300 993.1209 998.2788 1020.4980 1023.3639 1038.4827 1046.4940 1050.1885 1051.0988 1086.0022 1096.4521 1101.7465 1114.6355 1115.0866 1125.5340 1150.1970 1152.6501 1158.9372 1162.4948 1169.8863 1170.6162 1171.3624 1175.3802 1183.0983 1193.8971 1209.5397 1217.0409 1220.1203 1244.3236 1259.4962 1261.4768 1264.5810 1282.1708 1287.0762 1292.1971 1300.8344 1307.6447 1320.8542 1329.3438 1330.9932 1340.0313 1340.5906 1349.4396 1356.9650 1374.3229 1393.5566 1396.4358 1399.7087 1443.7326 1449.5836 1450.9218 1451.0738 1459.3334 1462.5700 1463.9225 1466.2664 1473.2070 1480.5528 1481.4274 1487.5327 1593.8940 1600.1737 1613.1830 1622.5545 2817.8513 2828.5568 2894.3300 2928.5034 2946.7364 2967.0044 2984.3149 2984.9814 2992.8593 3006.9868 3022.9122 3027.1470 3034.3750 3044.9566 3047.5861 3048.1232 3054.1755 3066.7934 3071.7738 3116.7844 3117.5804 3124.0008 3125.7599 3138.0764 3139.0558 3158.2042 3158.6383
redmass: 4.1995 3.3002 4.0160 4.5995 4.1965 3.4603 2.0869 3.7176 4.7755 4.2219 3.4760 3.5574 3.2954 2.0749 3.0334 2.7813 2.6083 4.0644 3.7410 4.2374 2.4373 2.3981 4.1674 2.8769 3.1645 3.4437 3.0874 4.7330 3.9453 2.9304 2.5668 3.4854 4.1801 4.9503 6.4197 4.9707 2.7712 2.3779 2.2076 1.4863 3.0155 3.4906 1.3685 1.3744 2.6861 2.4681 2.9020 1.6150 2.1798 1.3749 1.7578 4.0609 2.3346 3.9035 1.4153 1.4742 1.3368 2.7303 1.3198 1.3184 2.6481 2.8869 2.5390 2.2562 2.9892 3.2190 2.8344 1.8977 2.5906 2.0302 1.7022 1.8071 1.9735 2.0655 1.3246 1.2697 2.2596 1.6908 1.1495 1.1310 2.1792 1.2078 1.2588 1.4701 1.6944 2.0211 1.4859 1.7290 1.2572 1.9361 1.1860 1.2092 1.4207 1.3908 1.2951 1.4383 1.4018 1.3210 1.4296 1.4277 1.3685 1.5022 1.3959 1.4018 6.8103 6.1729 1.4617 2.0446 1.2468 2.2946 1.0921 1.0884 2.3681 1.0839 1.0865 1.0826 1.1078 2.6818 1.0862 6.2517 7.1574 7.0256 7.2047 1.0715 1.0699 1.0697 1.0596 1.0844 1.0620 1.0619 1.0611 1.0981 1.0610 1.0873 1.0905 1.0939 1.1033 1.0875 1.0920 1.1036 1.0882 1.1049 1.0858 1.0854 1.0895 1.0888 1.0941 1.0943 1.1004 1.1003
irintensity: 0.0514 0.0629 0.0862 0.6232 0.1467 0.1408 1.4271 0.7139 1.3401 1.0918 2.4354 1.6491 1.2595 0.5188 0.6094 1.9631 1.7508 1.1090 3.1523 0.3801 1.3918 2.4688 0.8300 1.0640 3.0340 7.2970 3.9029 1.1568 3.6841 13.2272 15.7659 3.5128 3.7711 13.6323 1.1878 2.9668 12.4824 6.1071 11.5309 92.3864 7.4932 9.6579 1.3428 0.5253 0.1432 0.4933 1.8290 3.7161 8.4177 0.2692 0.3505 2.8700 2.0607 1.7907 0.4653 1.0389 3.6796 3.0737 0.0776 0.0310 50.3740 10.9889 7.3742 12.0594 93.6336 136.9866 23.0855 15.5468 1.8853 4.9112 20.2122 10.4882 23.1407 4.8770 2.5716 14.2255 33.4213 1.1168 1.1400 2.7939 8.0120 2.7471 3.4579 2.9234 2.6675 2.0932 6.1233 10.7269 2.7897 2.7176 4.5501 11.8803 1.5108 10.1960 11.4308 6.0314 10.3778 1.6252 2.9030 2.8785 6.5013 2.8602 3.3185 8.8332 0.1823 0.2949 0.4089 6.3314 9.1903 0.1289 7.2001 13.5827 38.8269 4.6488 6.1990 6.8416 5.4768 11.6273 7.7860 2.0784 0.1119 0.0276 0.0542 46.1971 149.4441 76.6770 53.1706 53.4749 38.9251 31.8755 35.7821 28.0073 40.2653 57.1190 62.9562 31.2968 22.4350 28.0608 48.2627 102.2514 13.6332 27.9252 2.5173 5.0387 2.8375 3.7949 21.6302 44.6582 62.6010 17.1137
temp: 298.150 k
press: 1.00000 atm
elementType: 8 7 6 6 6 6 6 6 6 6 6 6 6 6 6 6 6 6 6 6 6 6 6 6 6 1 1 1 1 1 1 1 1 1 1 1 1 1 1 1 1 1 1 1 1 1 1 1 1 1 1 1
symmnumber: 1
zpe: 1166825.5 jmol-1
zpe.correction: 0.444420 hartree
zpe.thermalcorrener: 0.465525 hartree
zpe.thermalcorrenthalpy: 0.466469 hartree
zpe.thermalcorrgfe: 0.392665 hartree
zpe.sumelectzpe: -1020.778141 hartree
zpe.sumelectthermal: -1020.757036 hartree
zpe.sumelectthermalent: -1020.756092 hartree
zpe.sumelectthermalfe: -1020.829896 hartree
dipole: 1.1770 -0.9562 0.4206
dipole: 1.5737
quadrupole: -144.5346 -143.3135 -140.4520
quadrupole: 3.1643 -6.0195 2.5044
quadrupole: -1.7679 -0.5468 2.3147 3.1643 -6.0195 2.5044
hfenergy: -1021.2225614 hartree
pointgroup: C01 [X(C23H27N1O1)]
dipole: 0.4029407 0.3093913 -0.3539219 debye
polarizability: 270.0109329|-13.3868214|252.060759|18.7285225|-11.4720738|218.2279141 unknown
InChI: InChI=1S/C23H27NO/c1-6-12-24(13-7-1)14-15-25-22-16-21-17-8-2-4-10-19(17)23(22)20-11-5-3-9-18(20)21/h2-5,8-11,21-23H,1,6-7,12-16H2
charge 0 multiplicity 1
52 atoms
O  0.645798 0.18066 0.344517
N  4.293528 0.489795 -0.435378
C  -1.71009 0.502254 0.885876
C  -2.479074 -1.049547 -1.080784
C  -0.640505 0.548705 -0.261239
C  -1.075573 -0.415401 -1.417481
C  -1.869392 -0.958204 1.299659
C  -3.017277 0.956326 0.238905
C  -2.301907 -1.798299 0.238323
C  -3.436299 0.114858 -0.82831
C  -1.624677 -1.496141 2.575799
C  -3.779066 2.084715 0.595253
C  -2.492787 -3.176044 0.453508
C  -4.618769 0.401583 -1.535636
C  1.801009 0.510546 -0.501011
C  3.056149 0.133251 0.300538
C  4.664551 1.918997 -0.269652
C  5.436851 -0.403108 -0.115652
C  -1.824064 -2.881583 2.797604
C  -4.972329 2.37276 -0.114231
C  -2.256634 -3.717991 1.741886
C  -5.389971 1.535296 -1.174436
C  5.845106 2.298372 -1.18672
C  6.643375 -0.101283 -1.028056
C  7.06053 1.383006 -0.914271
H  -1.39134 1.149963 1.718911
H  -2.819066 -1.709009 -1.897765
H  -0.572875 1.592806 -0.637315
H  -0.328522 -1.225238 -1.506077
H  -1.13137 0.11907 -2.382204
H  -1.276346 -0.849176 3.388971
H  -3.455552 2.733192 1.418038
H  -2.823555 -3.824065 -0.367019
H  -4.943846 -0.247641 -2.357302
H  1.781361 -0.058628 -1.453387
H  1.789238 1.595991 -0.74629
H  2.999966 0.616901 1.305636
H  3.038683 -0.95875 0.469484
H  4.944405 2.135208 0.796911
H  3.785818 2.546404 -0.507163
H  5.109212 -1.450113 -0.25521
H  5.754052 -0.292286 0.956163
H  -1.641097 -3.307805 3.790584
H  -5.574973 3.245558 0.161467
H  6.111482 3.360685 -1.023724
H  5.526501 2.188653 -2.241401
H  6.360595 -0.326388 -2.074744
H  7.48585 -0.766333 -0.756162
H  -2.409951 -4.788291 1.921402
H  -6.314982 1.762281 -1.716587
H  7.884383 1.60995 -1.617188
H  7.444149 1.578734 0.108864
