program: Gaussian 09
title: 000202897
version: EM64L-G09RevD.01
frameworkgroup: C1[X(C18H17ClN2O2)]
method: RPBEPBE
basis: SDD
operation: Freq
keyword: #p
keyword: freq=noraman
keyword: PBEPBE/SDD
title: #p freq=noraman PBEPBE/SDD
converged: YES YES NO NO
title: Mulliken charges:
elementType: Cl O O N N C C C C C C C C C C C C C C C C C C H H H H H H H H H H H H H H H H H
charge: -0.059175 -0.189570 -0.195676 -0.114049 -0.330224 -0.444198 -0.437092 -0.482376 0.151271 0.145098 0.535710 0.441120 -0.324000 -0.343757 -0.369251 -0.444412 0.527027 -0.272053 -0.398373 -0.225995 -0.219525 -0.240599 -0.796792 0.287293 0.221417 0.213051 0.266637 0.231587 0.200563 0.272851 0.252308 0.262691 0.233008 0.237830 0.229480 0.227960 0.231065 0.247442 0.223515 0.248192
chargesum: 0.00000
title: Mulliken charges with hydrogens summed into heavy atoms:
elementType: Cl O O N N C C C C C C C C C C C C C C C C C C
charge: -0.059175 -0.189570 -0.195676 -0.114049 -0.330224 0.064512 0.042596 -0.050225 0.151271 0.145098 0.535710 0.441120 -0.051148 -0.091449 -0.106560 -0.211404 0.527027 -0.272053 -0.160543 0.003485 0.008435 -0.009534 -0.077643
polarizability: 2.84974050e+02 1.89952157e+00 2.30124125e+02 1.95374423e+01 -3.87252560e+00 1.40841805e+02
1716.lowfreq: -11.6751 -2.2643 -0.0018 -0.0015 -0.0011 3.1735 14.9204 17.3046 25.7223
frequency: 14.5055 16.9863 25.5799 40.0889 53.5010 67.2625 96.3685 111.6086 115.3265 145.7419 156.3447 186.7384 195.4042 219.3301 235.2159 271.9578 298.0483 310.1599 317.1740 353.7432 404.4188 405.4879 423.6501 440.7151 446.8502 451.2468 463.2539 509.6464 540.4600 562.1499 585.1164 604.5022 615.8526 620.3758 643.0280 666.5114 701.3056 705.4918 708.1106 751.1511 806.1896 820.4329 820.8324 859.8714 875.1258 896.1086 918.2781 932.4033 952.1193 961.2968 977.8777 984.2690 990.3016 995.8907 1001.9306 1017.9865 1025.4412 1031.1963 1035.4677 1046.9869 1080.7783 1115.4796 1153.0189 1162.6548 1170.1185 1172.3039 1182.4393 1193.7396 1210.7798 1230.5546 1238.2858 1249.6564 1272.2282 1278.8862 1303.9320 1318.2147 1329.2576 1354.3243 1364.8348 1373.8354 1391.1219 1395.5483 1403.0917 1440.6187 1443.0646 1452.7913 1460.7583 1470.0113 1471.3408 1484.3856 1486.7555 1575.6357 1595.5765 1608.6720 1615.1345 1615.8212 1649.9695 2819.1140 2827.6304 2863.7465 2985.8118 2996.2566 3065.2946 3067.8454 3076.5200 3096.5874 3114.0729 3126.7732 3138.6422 3140.6367 3149.5008 3164.8391 3177.3834 3181.0870
redmass: 4.5909 6.2832 4.8155 9.1491 4.8344 6.0114 2.7862 3.9097 1.2774 3.4055 3.9761 5.8122 5.0260 5.4230 5.1723 5.2919 3.7186 2.7453 2.8949 4.2450 2.8430 6.5058 5.5797 3.3880 4.7404 3.8476 3.5516 5.9042 4.7955 5.2799 4.2101 4.1923 5.7977 4.8543 5.0657 6.1682 4.3329 2.2816 2.8540 1.6193 3.9158 3.6592 1.5025 1.2500 1.4980 3.7069 1.5300 3.9342 1.3703 1.9869 1.9346 1.4137 6.0168 1.5076 1.3594 2.4308 2.4243 3.2110 3.1064 1.5323 1.5987 2.8207 1.3208 1.6769 1.7705 1.0710 1.1129 2.0356 2.5131 4.3292 2.0190 1.7251 1.4144 1.4959 1.4003 6.0410 1.3071 1.5494 4.7588 2.2717 2.9386 3.2748 1.3299 1.8575 1.1016 1.1646 1.0448 1.1526 1.1331 2.1130 3.0210 6.7945 6.1588 11.0662 6.1270 7.6060 11.4591 1.0709 1.0696 1.0700 1.0370 1.0876 1.0972 1.0865 1.0868 1.0999 1.0878 1.0860 1.0912 1.0897 1.0959 1.1015 1.0952 1.0943
irintensity: 0.0354 0.2701 0.2540 0.2694 2.9319 1.8715 1.7925 1.7054 1.6018 1.2938 1.2920 2.2854 1.7889 0.6146 1.8012 3.1340 9.2960 4.1508 2.4977 5.3301 0.3421 2.5782 6.7761 0.5190 8.7646 12.0882 14.3414 16.0364 4.4330 8.0520 1.8216 4.1818 3.7432 18.2308 15.1888 6.0438 18.0159 14.6899 35.9112 67.4741 3.1218 10.4289 18.2535 0.4028 7.1564 12.4100 7.2672 13.2052 2.1025 2.7760 7.0736 0.2946 0.8057 14.3968 1.2588 25.2174 5.6211 10.6791 9.5355 8.6716 20.3919 122.7092 7.8477 73.2332 60.2620 0.9387 2.0371 11.6940 15.0408 14.2858 162.9102 72.7720 1.4955 11.5736 22.7860 211.2586 3.2384 2.8624 1.6320 1.3877 6.0224 12.2093 14.9763 16.4404 3.2025 3.9087 14.5027 17.4289 14.3595 9.9090 81.7451 29.2644 0.8409 362.8599 4.0004 7.8363 46.2335 49.4435 81.4279 100.7238 21.0568 17.3900 12.4898 6.2922 1.9779 16.9527 8.9162 0.0483 13.0369 14.0397 32.6319 23.0027 2.5140 2.2639
temp: 298.150 k
press: 1.00000 atm
elementType: 17 8 8 7 7 6 6 6 6 6 6 6 6 6 6 6 6 6 6 6 6 6 6 1 1 1 1 1 1 1 1 1 1 1 1 1 1 1 1 1
symmnumber: 1
zpe: 811892.2 jmol-1
zpe.correction: 0.309233 hartree
zpe.thermalcorrener: 0.330119 hartree
zpe.thermalcorrenthalpy: 0.331063 hartree
zpe.thermalcorrgfe: 0.255829 hartree
zpe.sumelectzpe: -1414.491277 hartree
zpe.sumelectthermal: -1414.470392 hartree
zpe.sumelectthermalent: -1414.469447 hartree
zpe.sumelectthermalfe: -1414.544681 hartree
dipole: 2.7892 -2.3193 0.5443
dipole: 3.6681
quadrupole: -117.1168 -137.2477 -150.5979
quadrupole: 1.7389 0.6561 -10.1359
quadrupole: 17.8707 -2.2603 -15.6104 1.7389 0.6561 -10.1359
hfenergy: -1414.8005105 hartree
pointgroup: C01 [X(C18H17Cl1N2O2)]
dipole: 1.0163328 -0.8377002 0.5898809 debye
polarizability: 282.1487691|7.748627|217.0882195|26.6620343|-31.3967172|156.7029922 unknown
InChI: InChI=1S/C18H17ClN2O2/c1-13-7-8-15(9-16(13)19)21-17(22)11-20(12-18(21)23)10-14-5-3-2-4-6-14/h2-9H,10-12H2,1H3
charge 0 multiplicity 1
40 atoms
Cl -4.255512 2.744083 -1.82708
O  -0.634101 1.19319 1.608915
O  -1.336459 -2.8321 -0.684929
N  1.752609 -1.166321 0.219211
N  -1.006311 -0.747538 0.345094
C  1.280145 -0.274892 1.289174
C  0.906512 -2.364374 0.133568
C  3.202192 -1.472385 0.299131
C  -0.175144 0.141215 1.10184
C  -0.559426 -2.02255 -0.121503
C  -2.386273 -0.351037 0.088654
C  4.077455 -0.249995 0.041268
C  -2.634251 0.830061 -0.642611
C  -3.458324 -1.135496 0.560594
C  3.757987 0.652888 -1.004516
C  5.244583 -0.025555 0.811064
C  -5.078873 0.450902 -0.433951
C  -3.966318 1.203996 -0.882773
C  -4.782268 -0.731273 0.293056
C  4.592838 1.758619 -1.275352
C  6.085853 1.078025 0.537523
C  5.761943 1.973552 -0.506996
C  -6.506787 0.87284 -0.705355
H  1.87888 0.650124 1.302151
H  1.368507 -0.73685 2.309236
H  0.945051 -2.998188 1.060794
H  1.229413 -3.001305 -0.706775
H  3.406769 -2.241542 -0.472346
H  3.478522 -1.92517 1.284789
H  -1.808562 1.447517 -1.0041
H  -3.263002 -2.056134 1.116222
H  2.846195 0.482461 -1.587912
H  5.496908 -0.714001 1.627787
H  -5.614902 -1.344102 0.655456
H  4.334335 2.451896 -2.083696
H  6.985858 1.240811 1.141044
H  6.409982 2.831682 -0.71727
H  -6.70414 0.942202 -1.790833
H  -7.21903 0.154159 -0.267396
H  -6.714656 1.872783 -0.282476
