program: Gaussian 09
title: 000202912
version: EM64L-G09RevD.01
frameworkgroup: C1[X(C20H23NO)]
method: RPBEPBE
basis: SDD
operation: Freq
keyword: #p
keyword: freq=noraman
keyword: PBEPBE/SDD
title: #p freq=noraman PBEPBE/SDD
converged: YES YES NO NO
title: Mulliken charges:
elementType: O N C C C C C C C C C C C C C C C C C C C C H H H H H H H H H H H H H H H H H H H H H H H
charge: -0.272736 -0.120690 -0.645195 -0.554362 -0.022219 -0.503219 0.424074 0.416555 0.379063 0.390768 -0.455120 -0.481086 -0.473646 -0.475584 -0.292194 -0.241273 -0.237943 -0.239100 -0.237382 -0.309212 -0.613474 -0.607274 0.324059 0.236909 0.210475 0.260024 0.229299 0.228465 0.241979 0.238672 0.239820 0.212539 0.176958 0.218844 0.221370 0.220832 0.222283 0.233529 0.173480 0.221945 0.192908 0.223967 0.221539 0.195215 0.226139
chargesum: 0.00000
title: Mulliken charges with hydrogens summed into heavy atoms:
elementType: O N C C C C C C C C C C C C C C C C C C C C
charge: -0.272736 -0.120690 -0.321137 -0.317453 0.188256 -0.013895 0.424074 0.416555 0.379063 0.390768 -0.226655 -0.239108 -0.234974 -0.235765 0.097303 -0.022429 -0.016573 -0.018268 -0.015099 0.097797 0.025346 0.035620
polarizability: 2.34653443e+02 7.74431492e+00 2.37675649e+02 -1.61485533e+01 4.23786677e+00 1.73602115e+02
1716.lowfreq: -9.1077 -0.0002 0.0005 0.0006 7.9172 11.9273 19.1332 40.1763 52.1990
frequency: 19.0609 40.1243 52.1607 62.5574 66.8355 94.0771 132.3031 139.4087 161.5111 198.2651 220.7848 226.4899 264.0210 292.8150 302.4912 319.3183 347.4891 361.1771 369.3859 374.9892 408.9092 424.2414 431.4142 454.3686 499.0792 506.6436 512.3122 559.8179 578.2912 601.5428 628.5391 644.1687 713.1399 736.5565 751.6141 755.6024 760.0498 768.3372 787.0771 806.4303 816.9889 840.8956 847.9298 874.1336 885.2586 901.7627 934.7559 940.2062 941.7790 946.3358 960.3316 980.6275 982.1223 1001.7916 1021.1536 1023.5715 1030.8811 1034.0896 1050.2831 1060.2102 1079.2464 1089.3608 1092.9695 1112.4351 1134.9622 1150.0310 1163.5094 1168.9196 1169.5142 1171.4396 1179.8341 1188.9185 1202.8642 1211.3077 1221.0101 1229.1569 1245.6932 1264.1428 1273.9104 1282.6811 1296.5401 1306.5923 1319.6103 1344.2335 1346.4888 1363.3799 1371.2587 1393.7698 1399.6768 1417.0367 1434.2262 1442.5281 1447.1233 1451.5426 1454.3422 1457.9441 1462.4141 1463.9881 1471.9014 1476.6748 1481.0695 1485.6068 1593.0844 1598.2870 1612.4359 1621.0325 2824.3205 2854.2891 2869.8557 2951.1984 2956.0164 3014.0192 3020.4958 3029.4339 3033.2603 3034.5210 3044.5271 3050.4736 3079.2751 3080.6855 3085.5806 3114.8370 3115.7247 3121.7672 3122.2620 3135.7121 3136.5044 3156.0721 3157.1113
redmass: 3.8421 2.9751 4.2523 3.5488 4.8251 3.0333 3.7584 3.8357 3.7700 2.2151 1.4087 1.3130 2.5873 2.9921 2.9511 2.6679 4.0343 2.9681 4.1974 2.1829 2.6726 2.6489 4.2636 3.4604 3.8014 4.6345 2.9333 3.6889 3.7655 4.2749 5.0366 6.4302 4.1448 3.4611 1.6105 3.6365 1.6109 2.3635 3.6589 3.0592 2.7665 2.9165 2.6485 1.3684 1.8330 4.0500 2.4218 1.6994 1.4887 2.0141 2.9662 1.3135 1.3162 2.4451 2.4357 2.2084 1.5231 2.8037 2.3787 3.3603 2.1429 1.5897 2.0837 1.7366 1.4426 1.2710 1.5640 1.1504 1.1183 2.3439 2.0301 1.3982 1.7746 1.9264 1.3273 1.4866 1.6940 1.9905 1.7323 1.4548 1.2813 1.3477 1.4053 1.4793 1.3151 1.3325 1.2801 6.4402 4.8589 1.1412 1.1275 2.2689 1.0941 2.4091 1.1373 1.1163 1.1480 1.9894 1.0642 1.0582 2.6141 1.0602 6.0843 7.0604 6.9680 7.1703 1.0704 1.0567 1.0563 1.0848 1.0634 1.0607 1.0733 1.0737 1.0901 1.0932 1.0917 1.0873 1.1011 1.1044 1.1004 1.0850 1.0852 1.0891 1.0894 1.0941 1.0940 1.1003 1.1003
irintensity: 0.0227 0.4036 0.3237 0.6839 1.1525 0.3963 0.2767 0.0531 0.2458 1.3308 0.6707 0.6820 1.1315 2.1440 5.5899 3.4861 1.3539 4.9257 0.1001 8.0559 0.7472 2.4624 1.1919 2.1733 3.7600 0.6865 14.4738 27.6371 5.1021 4.4969 13.7729 1.4459 1.3937 18.7884 18.5908 7.3741 81.1365 16.1076 6.8241 4.3156 2.9329 1.6626 0.9903 0.6012 1.8243 10.1757 12.2447 18.1028 2.5127 16.2646 22.1959 0.0811 0.0453 19.3380 0.9084 10.4202 10.8960 75.6217 59.7797 4.0980 42.0067 11.3369 23.7941 7.0314 5.1382 14.5260 2.2841 0.8810 0.6882 14.8558 3.7507 1.9252 5.0780 0.2442 6.6487 13.8313 12.0938 3.4380 18.2473 2.0383 29.9307 0.1318 1.7254 20.4012 16.0379 1.3097 2.2360 0.8744 0.3839 1.9043 2.1144 9.0560 7.2587 1.1696 10.9448 4.8577 29.6491 25.5806 17.1980 22.1217 8.9287 13.6723 2.0654 0.1462 0.0491 0.6882 94.7099 77.7627 272.0224 24.9607 89.1484 31.7147 38.6839 24.6869 3.6587 56.9348 26.0471 38.5485 26.2287 24.5034 38.5157 3.8076 5.8955 4.4410 2.6534 25.4530 51.4685 52.9219 31.0075
temp: 298.150 k
press: 1.00000 atm
elementType: 8 7 6 6 6 6 6 6 6 6 6 6 6 6 6 6 6 6 6 6 6 6 1 1 1 1 1 1 1 1 1 1 1 1 1 1 1 1 1 1 1 1 1 1 1
symmnumber: 1
zpe: 996376.5 jmol-1
zpe.correction: 0.379500 hartree
zpe.thermalcorrener: 0.398715 hartree
zpe.thermalcorrenthalpy: 0.399659 hartree
zpe.thermalcorrgfe: 0.331326 hartree
zpe.sumelectzpe: -904.275298 hartree
zpe.sumelectthermal: -904.256083 hartree
zpe.sumelectthermalent: -904.255139 hartree
zpe.sumelectthermalfe: -904.323471 hartree
dipole: 2.3237 -1.4926 0.0801
dipole: 2.7629
quadrupole: -114.5904 -126.4394 -130.1305
quadrupole: -3.6869 -6.5918 -0.8223
quadrupole: 9.1297 -2.7193 -6.4104 -3.6869 -6.5918 -0.8223
hfenergy: -904.6547974 hartree
pointgroup: C01 [X(C20H23N1O1)]
dipole: 0.8820681 0.6348433 -0.0234595 debye
polarizability: 232.1671601|-5.8944757|237.0937056|21.8999176|-2.338659|176.6703408 unknown
InChI: InChI=1S/C20H23NO/c1-21(2)11-12-22-19-13-18-14-7-3-5-9-16(14)20(19)17-10-6-4-8-15(17)18/h3-10,18-20H,11-13H2,1-2H3
charge 0 multiplicity 1
45 atoms
O  1.842795 -0.612317 -1.835435
N  3.463136 0.974584 0.576664
C  0.263501 0.310915 -0.062049
C  -1.753666 -0.678362 -1.420548
C  0.647868 0.212157 -1.592105
C  -0.528776 -0.438514 -2.379292
C  -0.148014 -1.083854 0.394991
C  -0.977851 1.19987 -0.031524
C  -1.250685 -1.617234 -0.326749
C  -2.073395 0.666459 -0.766861
C  0.454221 -1.83706 1.419914
C  -1.099675 2.442973 0.618274
C  -1.750058 -2.897784 -0.024315
C  -3.289189 1.370847 -0.842076
C  3.140808 0.070038 -1.798492
C  -0.049451 -3.12451 1.731746
C  -2.324457 3.15394 0.544094
C  -1.146955 -3.653059 1.012773
C  -3.414442 2.619924 -0.181842
C  3.878984 -0.017365 -0.446688
C  3.894996 2.351578 0.253967
C  3.90492 0.577933 1.932017
H  1.120045 0.719758 0.500995
H  -2.612094 -1.095687 -1.974253
H  0.845799 1.244132 -1.954623
H  -0.173669 -1.403952 -2.779743
H  -0.832637 0.200133 -3.227039
H  1.303944 -1.424862 1.97697
H  -0.254384 2.852899 1.183807
H  -2.599562 -3.307224 -0.584193
H  -4.134576 0.957233 -1.404969
H  3.752614 -0.46186 -2.551573
H  3.029859 1.124068 -2.131817
H  0.410695 -3.71329 2.533754
H  -2.429039 4.118456 1.054184
H  -1.53327 -4.648578 1.259982
H  -4.359725 3.172424 -0.231964
H  3.695289 -1.030617 -0.043992
H  4.981056 0.060875 -0.651378
H  3.481175 2.671361 -0.717599
H  5.008977 2.457592 0.206559
H  3.51729 3.047593 1.023923
H  3.520296 1.299043 2.675617
H  5.018268 0.534901 2.038349
H  3.50093 -0.42006 2.178532
