program: Gaussian 09
title: 000202886
version: EM64L-G09RevD.01
frameworkgroup: C1[X(C11H20N6)]
method: RPBEPBE
basis: SDD
operation: Freq
keyword: #pfreq=noraman
keyword: PBEPBE/SDD
title: #p freq=noraman PBEPBE/SDD
converged: YES YES NO NO
title: Mulliken charges:
elementType: N N N N N N C C C C C C C C C C C H H H H H H H H H H H H H H H H H H H H
charge: -0.126402 -0.174223 -0.174180 -0.133455 -0.133454 -0.201938 -0.451438 -0.451462 -0.357830 -0.357848 0.093234 0.155295 0.155307 -0.628698 -0.630914 -0.630912 -0.628701 0.219954 0.225181 0.219963 0.225184 0.244599 0.222569 0.222556 0.244628 0.214167 0.282241 0.214481 0.288699 0.213393 0.213511 0.288697 0.213388 0.213516 0.282243 0.214166 0.214481
chargesum: 0.00000
title: Mulliken charges with hydrogens summed into heavy atoms:
elementType: N N N N N N C C C C C C C C C C C
charge: -0.126402 -0.174223 -0.174180 -0.133455 -0.133454 -0.201938 -0.006303 -0.006314 0.109337 0.109336 0.093234 0.155295 0.155307 0.082191 0.084690 0.084689 0.082190
polarizability: 2.18301803e+02 1.15403980e-03 2.09884906e+02 -9.25179345e-03 -3.56218083e-01 1.01375025e+02
1716.lowfreq: -8.7247 -0.0005 0.0003 0.0005 3.8324 12.6335 53.8517 69.9266 75.6360
frequency: 53.2423 69.7861 75.6142 86.4194 94.5794 108.7553 112.3652 138.6004 140.4674 145.7879 151.7736 179.9998 184.7140 231.8808 235.3761 245.4295 266.9057 277.5266 296.3268 336.6632 337.9219 436.9654 475.6657 535.8316 539.6780 566.9599 660.2275 693.4834 696.8815 698.1067 780.0014 808.3578 833.4316 860.4003 865.1985 895.4224 911.7799 918.2849 967.6486 970.9946 1034.7506 1049.9446 1053.4032 1054.7842 1097.4797 1100.3031 1100.6784 1125.7153 1149.2414 1149.4398 1155.7906 1171.6133 1177.2297 1209.2646 1213.4914 1215.8673 1244.6193 1267.5233 1269.9639 1273.3152 1299.8799 1311.1000 1331.5332 1334.8793 1401.9582 1407.6808 1408.1421 1409.5362 1428.4620 1439.1706 1467.4765 1468.0623 1469.3840 1470.0767 1471.0807 1475.4536 1478.7938 1482.8478 1489.0554 1491.1350 1492.9231 1498.9338 1528.3029 1546.3469 1597.1464 2948.5793 2948.8848 2954.6574 2957.2040 2972.3541 2975.4575 3007.2466 3007.2713 3017.0600 3017.6181 3019.5994 3019.6900 3056.2583 3057.5387 3075.6303 3089.1166 3119.7143 3119.7819 3122.8726 3124.9501
redmass: 3.0919 2.6146 2.4668 2.3758 2.6716 2.3836 1.2787 1.0623 1.0484 1.6725 3.2927 3.8113 3.6266 3.9650 1.8023 2.7039 3.4966 3.7497 3.7818 3.1489 2.9317 3.0967 3.5160 6.2223 4.6265 1.8293 6.9359 3.6062 11.2669 10.1605 12.2010 2.3247 5.4103 2.3510 1.9422 13.3551 2.5390 1.3472 2.8646 1.7358 2.1933 2.0370 1.4070 1.3757 2.0077 1.2146 1.2168 1.9062 1.3642 1.3649 1.6495 1.7744 2.4124 2.1244 2.2247 1.4646 1.8270 7.1501 4.6144 6.2987 1.3762 1.2530 1.6165 1.6217 1.2434 1.2503 1.1982 1.2757 2.4986 3.5939 1.9838 1.4821 1.1104 1.0826 1.1007 1.1321 1.0449 1.0455 1.0458 1.0473 1.0849 1.1243 2.9546 2.1166 5.3074 1.0371 1.0372 1.0375 1.0377 1.0667 1.0686 1.0667 1.0605 1.1009 1.1008 1.1014 1.1014 1.0964 1.0945 1.1005 1.1054 1.0955 1.0955 1.0950 1.0945
irintensity: 1.8056 0.0000 3.1501 0.0005 3.2440 1.4744 0.0000 0.0000 0.2640 4.6287 0.8408 0.0439 0.0075 0.1430 0.0386 0.0019 0.4734 14.8013 0.1239 2.4656 3.2528 15.5929 16.3529 3.5660 4.6503 2.0254 0.3098 0.3357 0.1465 0.0337 20.0279 0.1544 13.9513 14.7016 2.2870 0.0117 16.4720 0.1966 26.5615 17.0222 171.4003 13.6233 1.3137 6.8540 14.1084 0.0142 0.0051 0.4452 0.1677 0.0024 33.0369 0.3400 67.0643 98.1890 57.4581 1.4214 0.6046 15.7441 19.0237 4.5583 5.9024 0.1226 53.7915 3.2562 116.9715 11.3583 24.3666 67.3223 0.0369 0.0477 598.3798 438.1443 16.6818 74.3376 201.5633 7.3915 0.1088 0.1424 0.0104 52.9270 15.9280 45.4165 1075.6799 729.5330 0.8528 11.2374 56.3225 354.2417 128.5877 76.6402 7.6670 36.5896 30.0040 0.0217 182.2807 0.0131 8.4046 41.7071 5.1584 38.4058 67.6756 1.5698 1.8060 0.7191 4.2751
temp: 298.150 k
press: 1.00000 atm
elementType: 7 7 7 7 7 7 6 6 6 6 6 6 6 6 6 6 6 1 1 1 1 1 1 1 1 1 1 1 1 1 1 1 1 1 1 1 1
symmnumber: 1
zpe: 824291.2 jmol-1
zpe.correction: 0.313956 hartree
zpe.thermalcorrener: 0.332257 hartree
zpe.thermalcorrenthalpy: 0.333201 hartree
zpe.thermalcorrgfe: 0.267689 hartree
zpe.sumelectzpe: -758.378712 hartree
zpe.sumelectthermal: -758.360411 hartree
zpe.sumelectthermalent: -758.359467 hartree
zpe.sumelectthermalfe: -758.424978 hartree
dipole: 0.7268 0.0001 -0.0001
dipole: 0.7268
quadrupole: -86.4691 -90.1896 -103.7267
quadrupole: 0.0002 0.0045 -0.0017
quadrupole: 6.9927 3.2722 -10.2649 0.0002 0.0045 -0.0017
hfenergy: -758.6926675 hartree
pointgroup: C01 [X(C11H20N6)]
dipole: -0.2859586 -0.0000633 -0.0000387 debye
polarizability: 218.3018025|0.0013362|209.6215875|0.0083757|5.3507188|101.6383428 unknown
InChI: InChI=1S/C11H20N6/c1-15(2)9-12-10(16(3)4)14-11(13-9)17-7-5-6-8-17/h5-8H2,1-4H3
charge 0 multiplicity 1
37 atoms
N  -2.124718 -0.000033 -0.000069
N  -0.127572 -1.222249 -0.069176
N  -0.127654 1.222368 0.069303
N  1.939456 -2.355136 -0.129055
N  1.939322 2.355305 0.13043
N  1.982255 0.000057 0.00128
C  -4.366811 0.721919 -0.282072
C  -4.366306 -0.722521 0.284654
C  -2.940504 1.23554 0.034282
C  -2.940258 -1.235796 -0.033395
C  -0.755049 0.000088 -0.000831
C  1.245782 -1.158555 -0.062591
C  1.24571 1.158635 0.064925
C  3.405001 -2.394846 -0.126982
C  1.238594 -3.641196 -0.203544
C  1.2384 3.641418 0.203402
C  3.404865 2.395065 0.128641
H  -4.52503 0.698862 -1.376321
H  -5.147875 1.360671 0.163826
H  -4.523226 -0.699494 1.379089
H  -5.147746 -1.361463 -0.160315
H  -2.562411 1.969005 -0.698184
H  -2.884105 1.709905 1.034694
H  -2.884894 -1.71014 -1.033876
H  -2.561163 -1.969187 0.698627
H  3.777959 -2.978458 0.738707
H  3.782477 -1.364732 -0.063228
H  3.784033 -2.869421 -1.054374
H  0.156314 -3.448392 -0.208159
H  1.521035 -4.185187 -1.127208
H  1.496813 -4.27785 0.666683
H  0.156126 3.448579 0.207915
H  1.520537 4.186337 1.126611
H  1.496871 4.277213 -0.667379
H  3.782392 1.36492 0.065675
H  3.778035 2.978137 -0.737319
H  3.783643 2.870236 1.055832
