program: Gaussian 09
title: 000202878
version: EM64L-G09RevD.01
frameworkgroup: C1[X(C7H8N4O2S)]
method: RPBEPBE
basis: SDD
operation: Freq
keyword: #p
keyword: freq=noraman
keyword: PBEPBE/SDD
title: #p freq=noraman PBEPBE/SDD
converged: YES YES NO NO
title: Mulliken charges:
elementType: S O O N N N N C C C C C C C H H H H H H H H
charge: 0.989921 -0.501259 -0.485188 -0.491111 -0.218288 0.038232 -0.035217 0.325882 0.449788 -0.332836 -0.279048 -0.354881 -0.347139 -0.794815 0.240889 0.284470 0.296702 0.245119 0.246726 0.237089 0.233171 0.251796
chargesum: 0.00000
title: Mulliken charges with hydrogens summed into heavy atoms:
elementType: S O O N N N N C C C C C C C
charge: 0.989921 -0.501259 -0.485188 -0.194410 -0.218288 0.038232 -0.035217 0.325882 0.449788 -0.091948 0.005422 -0.109762 -0.100413 -0.072758
polarizability: 2.75214929e+02 -6.94149351e+00 1.59307733e+02 1.19530453e+00 6.66086532e+00 1.22792121e+02
1716.lowfreq: -9.8368 -6.7336 -0.0024 -0.0019 0.0019 5.9233 18.4717 19.6806 25.6049
frequency: 18.1281 19.4661 25.5512 46.5950 63.1039 86.2791 91.5474 143.8706 152.8882 169.5622 204.5870 237.5608 313.0506 345.3258 378.0299 393.5013 406.4938 429.6260 468.6633 504.4051 530.7312 560.8709 628.6602 712.7138 740.2980 814.9912 825.6559 832.6875 838.6107 872.1199 956.2192 961.8566 980.0534 988.2641 1000.9006 1040.6218 1122.6889 1170.0504 1185.9436 1206.8824 1229.1972 1265.0269 1319.2871 1384.7221 1396.4190 1430.9350 1463.5964 1469.8854 1487.2661 1546.9046 1605.0528 1868.1533 2976.3073 3058.4025 3095.2907 3128.4744 3141.6415 3151.7912 3180.8442 3344.0710
redmass: 1.5473 2.3237 4.6608 9.4548 6.1028 9.3356 7.0470 10.2846 9.8163 7.8247 6.5287 12.1742 2.8762 4.9442 13.0894 3.5190 5.6200 3.3152 4.7933 13.7540 3.0251 13.8688 6.4585 2.8418 4.2976 1.5161 2.2311 3.1233 2.4183 1.7133 2.6424 2.1284 1.3940 1.4210 2.8345 1.6059 1.3282 11.6964 1.2034 1.2314 2.7134 3.9322 1.3164 3.1647 1.2354 3.4618 1.1381 1.0756 2.4596 5.0450 5.9260 14.0037 1.0403 1.0925 1.1002 1.0879 1.0906 1.0972 1.0961 1.0755
irintensity: 0.6934 0.3833 0.4034 0.4906 0.8172 1.2692 7.4232 22.7023 0.0774 23.3342 0.8360 8.5890 2.3488 19.3408 23.7904 11.1307 53.4867 27.9100 31.3198 0.4602 1.7287 0.4918 2.1696 0.8471 7.7140 8.0527 73.4732 21.7614 28.8220 118.5457 21.8189 28.7935 2.4376 0.1559 1.0866 17.6338 13.8630 60.7482 50.0923 1.4134 4.8420 72.9126 5.1687 1.9146 24.7228 7.7942 18.1756 11.7160 9.3718 0.1229 196.9156 320.5984 7.4767 22.5811 14.2442 4.9489 13.3861 16.1257 2.3864 24.7364
temp: 298.150 k
press: 1.00000 atm
elementType: 16 8 8 7 7 7 7 6 6 6 6 6 6 6 1 1 1 1 1 1 1 1
symmnumber: 1
zpe: 388860.1 jmol-1
zpe.correction: 0.148109 hartree
zpe.thermalcorrener: 0.163698 hartree
zpe.thermalcorrenthalpy: 0.164642 hartree
zpe.thermalcorrgfe: 0.100892 hartree
zpe.sumelectzpe: -1037.796287 hartree
zpe.sumelectthermal: -1037.780698 hartree
zpe.sumelectthermalent: -1037.779754 hartree
zpe.sumelectthermalfe: -1037.843504 hartree
dipole: 8.0468 -0.4691 -2.1906
dipole: 8.3528
quadrupole: -87.6999 -98.2307 -84.6664
quadrupole: 1.8162 2.5678 0.5519
quadrupole: 2.4991 -8.0317 5.5326 1.8162 2.5678 0.5519
hfenergy: -1037.9443961 hartree
pointgroup: C01 [X(C7H8N4O2S1)]
dipole: -3.1116471 -0.6897847 -0.8008596 debye
dipolederiv: 0.9062009 0.0200839 0.0335704 0.2082488 1.5465591 -0.2355171 0.2550815 0.1165604 0.9677951 -0.4911811 -0.0166177 0.0149897 -0.145279 -0.4667905 -0.0400634 -0.3010531 -0.2229342 -0.5411136 -0.8444504 -0.1732293 0.04795 -0.4208753 -0.6140676 0.0758088 -0.0211779 0.0801694 -0.4436899 1.0489506 0.0319234 0.0807892 0.1826146 -0.560069 0.2363334 -0.259033 0.1417875 -0.2232697 -0.2858136 0.0059498 -0.0298087 0.6025174 -0.6729606 0.416435 -0.4142074 0.5748663 -0.5502642 -0.0788646 0.0130517 0.0063833 -0.2320889 0.537568 -0.5167109 0.8438492 -1.099389 0.7875641 -0.0289724 0.0041182 -0.0082471 0.2227687 -0.3969926 0.2545994 -0.4610554 0.5092329 -0.4235741 -0.5615097 0.0842634 -0.1158245 -0.541826 0.0747462 -0.0492072 0.3009554 -0.0058649 -0.0029531 0.6092761 0.2289362 -0.1205379 0.4468726 0.2004445 -0.0498586 -0.3826825 -0.0645302 0.1496031 0.3610704 -0.0014404 -0.0701833 0.4871074 -0.0375176 0.0173047 0.1677366 -0.024857 0.1064735 0.3203192 0.1460653 0.0601644 0.0305804 0.0017171 0.0185036 -0.4671795 0.051897 -0.0798724 -0.5280755 0.0534222 0.104829 0.0376567 -0.0232138 0.1192452 0.6866838 0.1478054 -0.085783 -0.4937087 -0.1032113 -0.1190393 -0.4971416 -0.2085653 -0.0013408 -0.3163248 0.0190089 0.0996906 -0.140744 -0.0842244 0.0588611 -0.3543323 -0.0784719 0.0864597 0.323369 0.1152323 0.0026628 0.073331 -0.0244405 0.1038314 -0.0065139 0.105454 -0.0105438 0.0425956 -0.0345903 -0.013631 0.073433 -0.0761984 -0.0363699 -0.014695 0.0829891 -0.0258149 -0.0218668 -0.0232006 0.0751692 0.083225 -0.0122554 -0.0247294 0.0548144 0.2424124 -0.1340128 0.0767164 -0.0947257 0.1137188 0.0292307 -0.0769908 -0.0531617 -0.1124803 0.0457049 -0.0829641 -0.0480727 -0.0758953 0.0399282 0.0441845 -0.0052223 0.0720527 -0.0142268 0.1202642 -0.0322423 0.1095108 -0.0432792 -0.0336384 -0.0483085 0.0078299 0.0587162 0.0917127 0.0230268 -0.0932186 0.0439928 -0.086598 0.0396615 -0.0328377 -0.0548007 -0.0356636 -0.0231349 0.0938101 -0.0454617 -0.1281026 -0.0704591 -0.0447121 -0.0147551 0.032987 -0.0285719 -0.0022995 -0.0160475 0.0922664 -0.0297353 0.0897635 0.0602346 unknown
polarizability: 274.0296416|14.1462247|150.696765|1.4420272|-17.3529398|132.5883764 unknown
InChI: InChI=1S/C7H8NO2S.N3/c1-6-2-4-7(5-3-6)8-11(9)10;1-3-2/h2-5,8H,1H3;
charge 0 multiplicity 1
22 atoms
S  2.111279 1.135795 -0.139004
O  1.846764 1.243105 1.456334
O  3.251173 2.037912 -0.835203
N  0.342454 1.581086 -1.084964
N  2.519324 -0.979077 -0.62984
N  2.529636 -1.654315 0.439447
N  2.555369 -2.334095 1.426239
C  -0.764365 0.831054 -0.669223
C  -3.106121 -0.543241 0.213083
C  -1.405366 -0.127939 -1.51794
C  -1.295063 1.074365 0.638736
C  -2.571673 -0.777996 -1.087079
C  -2.443046 0.390955 1.062582
C  -4.329792 -1.290835 0.69578
H  -0.98645 -0.339117 -2.50951
H  -0.79308 1.799865 1.285107
H  0.60377 1.421444 -2.079979
H  -3.070965 -1.492375 -1.751124
H  -2.844487 0.581774 2.064164
H  -4.962975 -0.658964 1.343067
H  -4.944706 -1.657944 -0.143244
H  -4.033076 -2.172858 1.297473
