program: Gaussian 09
title: 000202883
version: EM64L-G09RevD.01
frameworkgroup: C1[X(C18H20N2)]
method: RPBEPBE
basis: SDD
operation: Freq
keyword: #pfreq=noraman
keyword: PBEPBE/SDD
title: #p freq=noraman PBEPBE/SDD
converged: YES YES NO NO
title: Mulliken charges:
elementType: N N C C C C C C C C C C C C C C C C C C H H H H H H H H H H H H H H H H H H H H
charge: -0.186158 -0.075251 0.179644 -0.555683 0.252602 0.149482 -0.373323 -0.412433 0.332019 -0.381552 -0.204477 -0.222937 -0.224599 -0.405572 -0.424933 -0.616240 -0.620749 -0.233757 -0.242655 -0.248185 0.217347 0.232072 0.226896 0.196818 0.268234 0.248399 0.238330 0.232728 0.223122 0.239991 0.243472 0.224682 0.186868 0.220104 0.217473 0.188963 0.232474 0.223684 0.225222 0.227879
chargesum: 0.00000
title: Mulliken charges with hydrogens summed into heavy atoms:
elementType: N N C C C C C C C C C C C C C C C C C C
charge: -0.186158 -0.075251 0.179644 -0.106263 0.252602 0.149482 0.050391 -0.144199 0.332019 -0.133153 0.033853 0.009791 -0.001477 -0.165582 -0.181461 0.015414 0.018161 -0.010073 -0.017433 -0.020307
polarizability: 3.20865537e+02 3.45771258e+00 1.93467126e+02 1.64119091e+00 -2.68181430e+01 1.40254173e+02
1716.lowfreq: -13.4832 -9.3977 -5.1780 -0.0007 -0.0006 -0.0004 8.0406 22.4208 45.8566
frequency: -5.8364 22.2458 45.8475 59.4386 65.4201 86.2544 96.3003 162.7815 182.8153 204.7945 221.3511 229.0583 243.8337 268.1724 281.4578 321.0289 339.5752 371.2980 408.9401 428.5921 436.3480 441.9005 492.4590 556.6601 568.6225 579.4242 584.8121 615.0045 666.2138 668.0999 706.6085 718.6892 729.8967 738.2511 747.5307 766.3680 780.9874 813.9580 824.1873 832.1114 855.2997 899.1237 922.0019 923.0924 960.2424 976.4026 986.1510 991.9307 994.8721 1008.5440 1011.3742 1029.6524 1034.2332 1051.9901 1066.6877 1077.8046 1091.2175 1111.7898 1133.9040 1152.3935 1168.0928 1171.1834 1175.6179 1187.9263 1217.6367 1229.5038 1259.9043 1262.2367 1289.2431 1291.5235 1298.7371 1316.2948 1358.3691 1364.9284 1371.6417 1377.2908 1416.8588 1422.2976 1439.5822 1442.2910 1452.6637 1460.2510 1461.1679 1468.0616 1474.6950 1475.6576 1481.0503 1486.9217 1516.6075 1539.2298 1542.8971 1581.7154 1615.9900 1632.9305 2841.7424 2846.2033 2863.5914 2995.1696 3014.4834 3019.8398 3026.9479 3066.4368 3073.5941 3084.1114 3120.6398 3126.7052 3140.2579 3146.1010 3148.6122 3159.5928 3163.6509 3170.5072 3188.6305 3226.1834
redmass: 3.0045 3.3580 3.7397 4.7613 3.8722 4.3285 2.0925 3.4657 4.1522 3.3176 1.2429 2.2346 1.2698 3.0549 5.6934 3.4687 2.6846 3.4474 2.8751 2.9406 2.9047 2.6978 3.9346 3.8313 3.6383 4.7785 4.9244 6.3328 1.9698 4.8258 1.8442 1.9813 3.5604 3.7204 1.5588 1.8701 2.2657 2.1991 1.6196 3.0475 1.2460 4.4636 1.4360 1.3355 1.2835 1.4579 3.7218 1.8725 1.8902 2.9031 2.6866 1.5650 1.8925 2.5536 2.4283 1.6097 1.2948 1.7100 1.4145 1.2618 1.5459 1.0729 1.7316 1.1239 1.9192 1.6831 2.2746 2.1743 2.4000 1.4835 1.3133 1.4339 2.5341 1.3322 5.2138 2.3063 1.1449 3.0654 1.2106 2.7708 3.3902 1.0734 1.0519 2.5522 1.0830 1.0569 1.0865 1.0623 5.5831 5.5962 6.0109 6.0552 6.3041 6.5109 1.0666 1.0586 1.0590 1.0630 1.0723 1.0860 1.0740 1.0986 1.1004 1.0998 1.0844 1.0873 1.0924 1.0863 1.0963 1.0890 1.1015 1.0959 1.1012 1.0974
irintensity: 0.2474 0.2564 0.0799 0.9707 0.3945 0.2630 0.9394 0.4751 0.3106 1.2780 0.4282 0.8615 0.6287 1.2627 0.1453 2.5011 6.6669 3.6337 0.1672 13.3069 0.8282 6.2272 3.5297 10.8942 2.2483 0.8677 7.5119 0.3678 12.8810 3.8718 46.3635 1.3400 7.3937 4.9936 148.5519 6.7148 24.4085 1.4208 2.4640 12.8153 0.0897 0.8476 5.3488 0.4885 0.1463 0.3746 1.9563 2.0366 1.9108 13.6860 0.4682 16.9498 15.8416 28.4106 19.6767 9.5864 6.1020 4.6610 13.6562 10.6530 8.8480 0.7930 5.1458 0.1609 11.8025 15.5025 2.5161 12.7657 50.3991 4.3725 4.8772 5.9520 8.1989 5.2543 5.0423 45.8824 3.8725 4.5704 3.3802 7.6236 16.3340 11.9505 16.1349 9.2469 5.4025 14.1811 13.5951 20.0931 4.2521 1.9105 1.5676 1.7105 22.1829 1.3875 54.2106 60.4617 202.9070 26.7501 44.0704 22.8240 39.8126 21.7263 47.6192 46.4960 5.4664 0.6650 23.2667 0.8282 41.1061 4.0498 24.8354 15.7273 16.6703 0.7875
temp: 298.150 k
press: 1.00000 atm
elementType: 7 7 6 6 6 6 6 6 6 6 6 6 6 6 6 6 6 6 6 6 1 1 1 1 1 1 1 1 1 1 1 1 1 1 1 1 1 1 1 1
symmnumber: 1
zpe: 874829.3 jmol-1
zpe.correction: 0.333205 hartree
zpe.thermalcorrener: 0.350608 hartree
zpe.thermalcorrenthalpy: 0.351552 hartree
zpe.thermalcorrgfe: 0.287001 hartree
zpe.sumelectzpe: -805.958050 hartree
zpe.sumelectthermal: -805.940646 hartree
zpe.sumelectthermalent: -805.939702 hartree
zpe.sumelectthermalfe: -806.004253 hartree
dipole: 0.3454 -0.6714 0.9737
dipole: 1.2322
quadrupole: -105.4851 -112.2484 -119.3116
quadrupole: -4.4409 2.1122 -4.2526
quadrupole: 6.8632 0.1000 -6.9632 -4.4409 2.1122 -4.2526
hfenergy: -806.2912544 hartree
pointgroup: C01 [X(C18H20N2)]
dipole: -0.1617175 0.1923703 0.4145456 debye
polarizability: 312.8808569|31.2721866|194.7010644|-14.7731383|29.3036554|147.0049152 unknown
InChI: InChI=1S/C18H20N2/c1-19(2)13-11-16-17(15-8-4-3-5-9-15)14-20-12-7-6-10-18(16)20/h3-10,12,14H,11,13H2,1-2H3
charge 0 multiplicity 1
40 atoms
N  -2.218746 1.181036 0.441923
N  0.987216 -3.676623 -0.310335
C  -0.521293 -0.127448 -0.41386
C  0.21189 -1.345692 -0.928027
C  -1.918377 -0.083625 -0.180083
C  0.024851 1.114064 0.074043
C  0.457831 -2.387693 0.198308
C  -1.034979 1.891343 0.596219
C  1.438327 1.56006 0.062028
C  -2.997528 -0.983974 -0.424726
C  -3.525315 1.53071 0.778185
C  -4.302835 -0.632767 -0.079675
C  -4.562398 0.646757 0.529108
C  2.0128 2.164992 1.214877
C  2.248159 1.429671 -1.100637
C  0.894236 -4.746357 0.704755
C  2.355324 -3.57008 -0.858061
C  3.3498 2.618111 1.208751
C  3.587293 1.876375 -1.105767
C  4.146545 2.47116 0.049372
H  -0.366599 -1.847957 -1.727379
H  1.178532 -1.049448 -1.369054
H  -0.506996 -2.595387 0.69835
H  1.131779 -1.931682 0.969762
H  -1.022561 2.899996 1.002695
H  -2.774816 -1.947266 -0.894047
H  -3.6654 2.513153 1.23575
H  -5.132181 -1.320077 -0.271103
H  -5.580434 0.938048 0.801282
H  1.406845 2.258421 2.123721
H  1.810838 1.013142 -2.014745
H  -0.153523 -4.852784 1.038689
H  1.527591 -4.559885 1.609935
H  1.210898 -5.708365 0.262106
H  2.673514 -4.555011 -1.244799
H  3.107616 -3.235081 -0.098204
H  2.379909 -2.85677 -1.698969
H  3.772445 3.077891 2.109529
H  4.190402 1.772169 -2.014981
H  5.185643 2.818773 0.044664
