program: Gaussian 09
title: 000202852
version: EM64L-G09RevD.01
frameworkgroup: C1[X(C6H12ClN)]
method: RPBEPBE
basis: SDD
operation: Freq
keyword: #p
keyword: freq=noraman
keyword: PBEPBE/SDD
title: #p freq=noraman PBEPBE/SDD
converged: YES YES NO NO
title: Mulliken charges:
elementType: Cl N C C C C C C H H H H H H H H H H H H
charge: -0.095798 -0.351094 -0.038342 -0.466851 -0.442061 -0.403783 -0.378366 -0.593129 0.227120 0.206365 0.236238 0.212087 0.226120 0.203815 0.210064 0.255501 0.230102 0.222928 0.271866 0.267218
chargesum: 0.00000
title: Mulliken charges with hydrogens summed into heavy atoms:
elementType: Cl N C C C C C C
charge: -0.095798 -0.095593 0.188778 -0.024248 -0.003853 0.010095 0.074664 -0.054045
polarizability: 9.09745147e+01 -1.41160941e+00 6.82137807e+01 -3.20870837e+00 1.66430338e+00 7.10018306e+01
1716.lowfreq: -13.0381 -0.0016 -0.0013 0.0018 7.1240 17.2266 48.8833 49.8831 105.4689
frequency: 48.0881 49.2103 105.4441 182.7548 200.7691 283.8328 419.2724 437.2691 473.6497 564.9779 593.2967 687.4105 787.8405 858.1824 882.1487 909.3705 913.5887 929.9810 951.1351 1011.2910 1044.6090 1073.7837 1103.1417 1123.4122 1153.9663 1173.2320 1186.6626 1210.9112 1219.0435 1281.9038 1288.8530 1300.9965 1307.1453 1329.6282 1348.4565 1361.5488 1412.8639 1439.8217 1453.7831 1464.2844 1472.7001 1502.0829 2918.1199 2957.1797 2976.9982 2990.7925 2994.0900 3012.3706 3042.1626 3057.0944 3068.3563 3079.5649 3133.8712 3500.3395
redmass: 2.3814 4.1774 4.3308 2.4102 1.9329 2.9003 1.7594 3.1760 2.4544 2.0787 4.7549 1.7721 1.9806 1.6979 1.7863 1.6768 2.4693 1.9577 1.8658 1.8078 1.7249 1.4241 1.8510 2.3666 2.0426 1.5107 1.3627 1.3278 1.3264 1.2840 1.2146 1.2411 1.2161 1.2663 1.3863 1.5414 1.3251 1.0908 1.0996 1.0891 1.0993 1.0850 1.0830 1.0617 1.0624 1.0644 1.0766 1.0873 1.0913 1.0641 1.0992 1.1041 1.1110 1.0767
irintensity: 3.6785 1.7037 3.7157 0.8475 3.9018 1.3027 18.4753 12.8168 65.9437 5.7527 22.8687 32.8708 5.8099 3.0135 3.6708 2.2099 5.5726 5.7077 19.5737 4.6702 1.3212 0.4020 15.5934 6.9714 29.6143 4.8833 0.8759 0.3587 2.7076 6.0521 33.0709 0.4645 4.4362 5.4235 0.9665 7.7807 11.8093 14.2640 15.1097 4.9568 6.3189 0.7476 36.5411 101.4905 17.6281 33.3371 14.6007 67.4558 11.7179 37.6870 24.6919 62.8945 20.8840 0.1281
temp: 298.150 k
press: 1.00000 atm
elementType: 17 7 6 6 6 6 6 6 1 1 1 1 1 1 1 1 1 1 1 1
symmnumber: 1
zpe: 456215.5 jmol-1
zpe.correction: 0.173763 hartree
zpe.thermalcorrener: 0.182593 hartree
zpe.thermalcorrenthalpy: 0.183538 hartree
zpe.thermalcorrgfe: 0.138570 hartree
zpe.sumelectzpe: -749.978743 hartree
zpe.sumelectthermal: -749.969913 hartree
zpe.sumelectthermalent: -749.968969 hartree
zpe.sumelectthermalfe: -750.013936 hartree
dipole: -1.6732 -0.0464 0.7778
dipole: 1.8457
quadrupole: -61.4268 -57.6350 -53.4742
quadrupole: 3.4919 5.5676 -1.8046
quadrupole: -3.9148 -0.1230 4.0378 3.4919 5.5676 -1.8046
hfenergy: -750.1525062 hartree
pointgroup: C01 [X(C6H12Cl1N1)]
dipole: 0.6401191 0.0013174 0.3428534 debye
dipolederiv: -0.4058975 0.0943915 -0.1244727 0.1215727 -0.2684041 0.0927676 -0.215868 0.1304946 -0.4070313 -0.7176515 -0.0159551 -0.029178 -0.0165395 -0.6082415 0.0478897 0.0505862 0.1470749 -0.2514641 0.5259368 -0.1017411 -0.0116795 -0.1412652 0.2378951 -0.0448402 -0.1212033 -0.0352126 0.2269126 -0.0400657 -0.0620826 0.0395459 -0.0168671 -0.0040052 -0.0946716 0.0163552 -0.0461522 0.1071197 -0.0075662 0.0286725 0.0728934 0.0059184 0.0037972 -0.0120978 0.0095759 -0.0551332 0.1462154 0.5109583 0.0738713 0.094304 0.1570671 0.186944 0.0038596 0.2135512 -0.0213475 0.292356 -0.0992419 0.0598304 0.028567 0.0432891 0.0049661 0.046808 -0.0669134 0.0636871 -0.0221195 0.3876808 -0.1203423 0.2515326 -0.1910861 0.2722718 -0.1764136 0.3210041 -0.1544073 0.5023385 -0.0408309 0.050128 -0.0570865 0.0528726 -0.0262179 0.0685496 -0.0696832 0.0740127 -0.1298945 0.0474088 -0.0229155 0.0073479 -0.0168071 0.0455811 0.0937184 0.0258648 0.0348947 -0.1550616 -0.0113913 0.1309548 0.0160935 0.1183861 -0.0687028 -0.0132869 -0.0010802 0.0099413 0.0668976 0.054455 0.0328218 -0.0165744 0.0085832 -0.0148586 0.0850644 0.0332259 0.1310277 -0.1127955 -0.0520793 -0.1098742 -0.0847549 -0.0910626 -0.0056403 -0.0643621 -0.1111798 -0.096245 0.0010464 -0.1383161 -0.0053298 0.1087927 -0.0026828 0.056556 -0.0201484 0.174625 -0.0365655 -0.0887615 -0.1052449 0.0171555 -0.0989956 0.0245927 -0.0043838 0.0582737 -0.2009063 0.0648393 -0.1142971 0.0874173 0.003969 -0.0176211 0.0050806 0.2285333 -0.0877362 -0.0100782 -0.1744445 0.0648309 0.0142704 -0.0567432 -0.013823 -0.0734395 -0.069814 -0.0838035 0.0053715 -0.1303954 0.0283911 0.0176985 0.0617067 -0.1042698 0.0417107 0.0671241 0.0619773 0.0021451 0.0644685 -0.072801 0.0771313 -0.0165198 -0.0921806 0.0265162 -0.0678515 -0.0585153 -0.0782537 -0.0473964 -0.0488772 -0.1046716 -0.0419979 0.0315591 -0.0558394 0.0344509 0.0969673 0.0228613 0.0768585 -0.0330047 unknown
polarizability: 90.4953226|-1.7760282|68.3284433|4.2561301|-1.8687023|71.3663602 unknown
InChI: InChI=1S/C6H12ClN/c7-4-3-6-2-1-5-8-6/h6,8H,1-5H2
charge 0 multiplicity 1
20 atoms
Cl -3.194423 0.4908 -0.878153
N  1.221771 -1.066871 -0.471298
C  0.032617 -0.183432 -0.277953
C  0.601521 0.993004 0.556935
C  2.038779 1.159035 0.003628
C  2.48816 -0.308098 -0.239582
C  -1.113149 -0.958678 0.408782
C  -2.360846 -0.134948 0.718247
H  -0.349673 0.217508 -1.244619
H  0.634641 0.709995 1.627572
H  -0.003558 1.910113 0.457074
H  2.009733 1.717293 -0.951175
H  2.706689 1.699915 0.696201
H  3.182315 -0.388775 -1.099377
H  3.019056 -0.70117 0.651014
H  1.202464 -1.612755 -1.338106
H  -1.393087 -1.835386 -0.20585
H  -0.721906 -1.357929 1.367923
H  -2.144359 0.777296 1.294417
H  -3.142243 -0.727618 1.216917
