program: Gaussian 09
title: 000203156
version: EM64L-G09RevD.01
frameworkgroup: C1[X(C17H26N2O4)]
method: RPBEPBE
basis: SDD
operation: Freq
keyword: #p
keyword: freq=noraman
keyword: PBEPBE/SDD
title: #p freq=noraman PBEPBE/SDD
converged: NO NO NO NO
title: Mulliken charges:
elementType: O O O O N N C C C C C C C C C C C C C C C C C H H H H H H H H H H H H H H H H H H H H H H H H H H
charge: -0.299606 -0.247771 -0.385423 -0.226502 -0.174031 -0.456396 -0.488920 -0.328576 -0.332558 0.156074 -0.667418 -0.670007 -0.352712 0.567078 -0.347190 -0.289651 0.116996 -0.674653 -0.385030 0.205903 -0.290387 -0.690408 0.178540 0.249894 0.253037 0.203352 0.211803 0.203879 0.228786 0.220385 0.221790 0.218140 0.224168 0.212525 0.216126 0.200671 0.230701 0.201893 0.190629 0.361015 0.223837 0.214304 0.216459 0.306275 0.279821 0.215668 0.215612 0.210308 0.351568
chargesum: 0.00000
title: Mulliken charges with hydrogens summed into heavy atoms:
elementType: O O O O N N C C C C C C C C C C C C C C C C C
charge: -0.299606 -0.247771 -0.033855 -0.226502 -0.174031 -0.095381 0.014011 0.086579 0.100107 0.156074 -0.007103 -0.017188 0.078660 0.567078 0.045332 0.148490 0.116996 -0.458194 -0.078755 0.205903 -0.010566 -0.048820 0.178540
polarizability: 3.42066179e+02 -1.48163828e+01 2.11326123e+02 6.49701417e+00 1.14732911e+01 1.51381744e+02
1716.lowfreq: -12.7349 -10.2717 -8.1398 -2.3716 -0.0017 -0.0008 -0.0006 1.8433 17.8709
frequency: -11.9877 -6.8149 17.6488 31.4253 38.5742 46.9300 50.7190 57.4438 76.2110 78.2115 96.4223 100.7331 114.5235 132.7528 176.2613 190.9319 205.4466 217.5435 226.7408 232.5999 248.3968 268.3924 282.1764 292.8852 307.3428 316.7656 347.0899 388.4415 388.5383 396.2296 406.1071 440.5208 453.4226 456.0894 511.2721 521.6723 556.2705 563.2403 572.8005 628.4092 672.6932 677.1760 736.1045 744.6048 751.3941 755.9778 790.0282 797.2374 806.0351 811.7071 825.3552 869.8210 879.1987 886.6600 897.1267 920.8798 934.7245 937.9617 982.9662 986.6723 998.8882 999.8713 1010.9378 1037.2283 1068.5222 1073.1518 1075.9169 1089.0535 1106.6666 1112.9133 1115.6320 1156.5300 1160.7250 1164.2660 1175.6041 1202.8143 1206.9959 1224.2355 1235.0253 1251.9147 1270.3117 1286.2433 1288.4094 1289.0289 1289.7909 1292.0369 1309.9832 1322.9846 1344.4516 1364.4863 1368.3615 1369.4368 1379.8043 1388.3737 1393.4574 1394.9143 1415.2317 1448.5584 1450.5175 1468.7043 1469.9081 1470.6229 1475.8316 1476.0058 1477.5081 1479.1495 1483.4043 1488.3176 1491.9894 1506.4608 1515.6291 1587.3244 1619.7091 1628.0697 1635.4693 2895.8668 2902.0468 2967.7781 2971.4245 2976.2859 2986.8907 2988.5342 2991.7533 3013.0753 3016.1643 3027.3490 3043.3271 3045.7203 3051.9385 3073.7469 3076.3003 3084.6461 3086.0219 3088.5893 3089.4023 3093.6482 3102.1786 3179.3583 3200.9962 3202.5485 3543.4592
redmass: 3.3365 3.6348 4.5192 3.6195 3.2363 4.6411 3.5878 2.2426 4.6942 2.6179 2.1417 2.6704 2.7238 5.7986 2.7463 3.6736 1.9938 1.4842 1.1971 3.8650 2.5920 3.6731 3.2738 2.2412 4.2495 3.7982 2.9813 1.6131 2.5212 3.0073 3.9938 3.7832 2.7764 2.9379 5.1823 3.7807 3.8542 6.0280 4.6714 7.2487 5.6199 3.0173 2.2787 1.2920 3.2189 2.7618 2.1069 1.1439 1.3241 1.9061 1.9776 1.4778 4.8945 1.8492 1.9118 5.4662 1.2166 1.2018 2.0258 2.8670 2.5920 1.3401 5.6537 4.5074 2.7027 2.4254 1.9828 2.0271 2.1134 1.9370 2.4298 1.7830 1.4941 1.4218 2.4209 2.2843 1.6080 1.5069 2.6224 1.3249 1.2823 1.2426 1.1274 1.2106 1.1852 1.5168 2.0019 1.3821 1.4483 1.3538 1.3880 1.5137 3.2032 1.2162 1.2316 1.2269 4.7966 1.0817 1.0992 1.0495 1.0655 1.0672 1.0468 1.0593 1.0608 1.0554 1.0668 1.0846 1.1422 1.9043 3.5722 5.5127 6.2761 9.8176 8.7046 1.0713 1.0701 1.0587 1.0631 1.0363 1.0358 1.0359 1.0604 1.0959 1.0606 1.0908 1.0944 1.0928 1.1027 1.1009 1.0997 1.0990 1.0987 1.1004 1.1002 1.1082 1.0910 1.0895 1.0957 1.0775 1.0657
irintensity: 0.1943 0.5919 2.7014 0.3786 1.0196 0.0548 0.5336 0.5409 3.2083 0.9875 1.7650 0.6384 1.7750 0.3506 0.4296 1.9507 4.1113 2.4230 0.2048 1.1830 0.5035 10.1937 8.8706 2.4672 11.6254 7.3220 1.1754 67.4366 33.5444 21.7718 19.0432 10.8868 3.8804 7.3293 5.1687 3.4189 1.2147 24.0399 17.0774 0.7551 12.9289 24.9550 15.7741 3.5178 2.5231 25.0844 3.3337 2.4984 2.3161 1.2604 10.3747 51.9894 13.4201 5.0904 9.4516 2.1067 58.7886 0.2275 14.2797 11.8947 9.2885 0.8301 325.2572 202.1731 22.3585 5.1378 25.0617 10.5079 195.5929 47.1313 14.1774 16.3641 49.8205 2.4151 41.4152 33.3281 22.2643 112.4048 284.1062 18.6672 12.3834 9.4701 7.8844 7.5047 16.2226 19.3788 7.6814 5.8286 6.3250 8.6160 6.2351 93.5024 88.4644 9.0180 14.4383 20.6800 56.2585 8.7637 34.2013 2.2096 22.6410 0.2067 10.6116 36.8135 5.6366 9.3219 10.5658 18.3849 24.8972 439.3332 359.5224 17.9654 287.6521 357.4060 198.3355 33.7679 182.2231 34.2239 35.9600 34.8516 20.6812 18.8765 18.7924 14.4428 62.5901 9.4932 8.7756 15.5982 4.9411 56.4003 57.6226 31.0277 39.8467 96.7923 28.7376 42.8522 15.3286 1.5572 16.0063 475.6010 22.2398
temp: 298.150 k
press: 1.00000 atm
elementType: 8 8 8 8 7 7 6 6 6 6 6 6 6 6 6 6 6 6 6 6 6 6 6 1 1 1 1 1 1 1 1 1 1 1 1 1 1 1 1 1 1 1 1 1 1 1 1 1 1
symmnumber: 1
zpe: 1071901.5 jmol-1
zpe.correction: 0.408266 hartree
zpe.thermalcorrener: 0.432285 hartree
zpe.thermalcorrenthalpy: 0.433230 hartree
zpe.thermalcorrgfe: 0.352450 hartree
zpe.sumelectzpe: -1072.038613 hartree
zpe.sumelectthermal: -1072.014593 hartree
zpe.sumelectthermalent: -1072.013649 hartree
zpe.sumelectthermalfe: -1072.094429 hartree
dipole: 6.3154 1.9579 1.3601
dipole: 6.7503
quadrupole: -101.0612 -147.1936 -137.3855
quadrupole: 21.0711 5.6466 -0.7082
quadrupole: 27.4856 -18.6469 -8.8387 21.0711 5.6466 -0.7082
hfenergy: -1072.4468784 hartree
pointgroup: C01 [X(C17H26N2O4)]
dipole: -2.4984728 0.2448322 0.8665583 debye
polarizability: 341.9552026|15.1624652|152.0315917|8.7650778|11.821472|210.7872522 unknown
InChI: InChI=1S/C17H26N2O4/c1-4-7-10-23-17(22)14-9-8-13(11-15(14)20)18-16(21)12-19(5-2)6-3/h8-9,11,18,20H,4-7,10,12H2,1-3H3
charge 0 multiplicity 1
49 atoms
O  3.795781 -0.146754 -0.48928
O  -2.832253 -0.649298 -2.610002
O  1.094398 0.611051 2.77148
O  3.661767 0.397506 1.776846
N  -5.182995 -0.1266 0.209395
N  -2.589829 -0.124789 -0.30704
C  -4.830497 -0.269208 -1.22734
C  -6.095423 1.02332 0.486225
C  -5.646402 -1.417413 0.806086
C  -3.304413 -0.381894 -1.46635
C  -5.405805 2.38889 0.309761
C  -5.484719 -1.477134 2.336398
C  5.792922 1.347402 -0.587575
C  -1.194955 -0.076631 -0.103563
C  7.338881 1.405314 -0.571104
C  5.278321 -0.084841 -0.38257
C  1.614038 0.0668 0.451573
C  -0.730423 0.231418 1.199878
C  -0.252338 -0.319395 -1.141859
C  0.652168 0.304997 1.481835
C  1.116316 -0.241933 -0.845618
C  7.876395 2.837711 -0.781117
C  3.077596 0.135295 0.698813
H  -5.179889 0.606884 -1.805299
H  -5.300804 -1.15938 -1.693694
H  -7.004355 0.97249 -0.16012
H  -6.445011 0.93189 1.529713
H  -6.707092 -1.624942 0.527348
H  -5.03662 -2.22276 0.35548
H  -6.119769 3.206308 0.517903
H  -5.025465 2.53024 -0.717735
H  -4.552661 2.487532 1.004011
H  -5.806687 -2.465377 2.711642
H  -6.092514 -0.713333 2.85262
H  -4.428101 -1.32787 2.622474
H  5.414104 1.737206 -1.552513
H  5.387524 1.994157 0.212987
H  7.711202 1.009765 0.395455
H  7.743242 0.738935 -1.360466
H  -3.253305 0.063136 0.476325
H  5.581759 -0.472668 0.606902
H  5.630763 -0.760369 -1.180905
H  -1.456351 0.419177 2.003354
H  -0.607362 -0.557424 -2.145429
H  1.850332 -0.426093 -1.633569
H  7.510965 3.516121 0.011915
H  8.981243 2.860972 -0.764501
H  7.543013 3.247427 -1.752904
H  0.320604 0.747764 3.376535
