program: Gaussian 09
title: 000202843
version: EM64L-G09RevD.01
frameworkgroup: C1[X(C11H10O4)]
method: RPBEPBE
basis: SDD
operation: Freq
keyword: #pfreq=noraman
keyword: PBEPBE/SDD
title: #p freq=noraman PBEPBE/SDD
converged: YES YES NO NO
title: Mulliken charges:
elementType: O O O O C C C C C C C C C C C H H H H H H H H H H
charge: -0.251883 -0.426774 -0.177420 -0.180663 0.149325 -0.494319 -0.556073 0.338650 0.185576 0.146233 -0.365990 -0.336308 -0.216402 -0.241690 -0.235186 0.255490 0.266523 0.270646 0.263180 0.284001 0.240440 0.232366 0.228527 0.232399 0.389352
chargesum: 0.00000
title: Mulliken charges with hydrogens summed into heavy atoms:
elementType: O O O O C C C C C C C C C C C
charge: -0.251883 -0.037422 -0.177420 -0.180663 0.149325 0.027694 -0.022247 0.338650 0.185576 0.146233 -0.081990 -0.095868 0.015965 -0.013162 -0.002787
polarizability: 1.59244234e+02 -6.82293910e-01 1.12997080e+02 -4.93436812e+00 1.84738240e+01 9.82617127e+01
1716.lowfreq: -14.0956 -10.2376 -6.8091 -0.0007 -0.0003 0.0006 25.7746 35.0690 63.9710
frequency: 25.5725 34.9686 63.9654 97.1596 118.5871 139.9335 227.9567 253.8292 300.0475 324.8586 356.5378 401.2210 409.5076 487.3602 501.1350 525.9801 563.4118 591.2480 613.5836 636.1298 646.9912 699.8100 706.9133 727.0695 772.2522 793.5482 855.5672 857.1736 884.8215 932.4039 964.9840 982.5642 990.1143 994.4719 1002.5582 1011.9279 1032.0738 1046.5734 1071.4664 1083.6185 1101.9803 1170.5329 1174.7371 1193.2537 1216.7571 1226.5246 1274.2593 1282.6846 1307.6459 1323.0606 1381.4786 1435.7290 1446.3537 1472.1480 1481.5800 1592.0635 1610.9760 1672.2489 1723.9181 3014.8380 3039.5939 3103.5229 3123.2073 3128.6121 3139.0040 3151.6194 3164.3691 3179.6578 3518.9592
redmass: 4.3590 10.7779 7.2827 5.6545 3.1318 5.0073 4.0386 3.5531 6.4802 5.1350 7.1585 2.9825 6.3491 3.3326 3.0621 3.5368 1.6523 3.6262 6.4364 3.0294 5.7040 3.9258 2.1672 3.4385 2.0726 3.1306 3.4198 1.2497 2.6879 1.4650 5.2571 1.4155 5.1838 2.3178 1.3519 2.7948 2.1178 3.9207 1.8206 2.6348 2.7766 1.4503 1.0527 1.1194 1.4905 3.3107 1.8982 1.4514 1.4560 1.3352 8.5825 2.2336 1.0800 1.0925 2.2237 6.2380 5.9972 10.0757 12.7006 1.0663 1.0636 1.0969 1.1028 1.0851 1.0889 1.0940 1.0986 1.0968 1.0643
irintensity: 1.2627 0.1120 0.3881 0.8888 5.4004 1.4434 0.2082 0.2357 0.6133 0.8866 6.0059 0.5208 5.0988 3.9221 1.8911 17.3399 74.6420 43.8173 1.1220 56.5380 20.2442 30.0519 43.8032 8.7695 33.5083 14.8761 86.5289 1.1410 5.6692 3.9255 88.5552 0.7070 0.3429 32.0499 2.3012 225.5251 20.2778 62.4949 12.2821 156.0033 48.0134 8.8665 0.1014 2.9946 8.0968 18.6244 11.5633 3.5505 5.4173 1.4742 0.1545 11.4558 17.8050 9.8290 19.4674 0.7193 5.8741 199.8517 384.1426 6.4631 11.5481 4.7525 5.6455 0.2390 8.5636 26.9451 18.7838 5.7313 33.3713
temp: 298.150 k
press: 1.00000 atm
elementType: 8 8 8 8 6 6 6 6 6 6 6 6 6 6 6 1 1 1 1 1 1 1 1 1 1
symmnumber: 1
zpe: 492749.1 jmol-1
zpe.correction: 0.187678 hartree
zpe.thermalcorrener: 0.200650 hartree
zpe.thermalcorrenthalpy: 0.201594 hartree
zpe.thermalcorrgfe: 0.146493 hartree
zpe.sumelectzpe: -724.991302 hartree
zpe.sumelectthermal: -724.978330 hartree
zpe.sumelectthermalent: -724.977386 hartree
zpe.sumelectthermalfe: -725.032487 hartree
dipole: -2.9107 3.8135 3.6684
dipole: 6.0392
quadrupole: -86.7557 -82.9475 -87.9696
quadrupole: 10.9552 8.5156 0.7066
quadrupole: -0.8647 2.9434 -2.0786 10.9552 8.5156 0.7066
hfenergy: -725.1789799 hartree
pointgroup: C01 [X(C11H10O4)]
dipole: 1.1614241 1.2426102 -1.6590589 debye
dipolederiv: -1.4463286 -0.5387643 -0.0739767 -0.3748867 -0.5298708 0.0361012 -0.3457464 -0.0810981 -0.3982218 -0.4572609 -0.1539223 0.0809609 -0.1753509 -0.919186 0.3870323 0.0785568 0.3249816 -0.5163493 -0.9336117 -0.3731875 0.0669967 -0.5323464 -0.6814571 0.1577378 0.2094782 0.2242174 -0.4847664 -0.3976908 -0.0207734 0.2350559 0.1284623 -0.6034786 -0.2233268 0.3827663 -0.0452495 -0.7631564 0.5370528 0.2287821 0.1120454 0.3471361 0.3446816 0.0011488 -0.2234004 -0.1746434 0.1642433 -0.0396381 0.0408592 -0.0618703 -0.046731 0.0345133 0.0067778 0.0555227 0.0704485 -0.0039612 -0.0518577 -0.0385117 -0.0400034 -0.0274992 -0.0255674 0.2164674 -0.1317472 0.1977217 -0.2144695 0.2109612 -0.1532924 -0.0407036 -0.0832297 -0.1194184 -0.0599299 0.0141331 -0.0491 -0.0647361 1.825118 0.8291194 0.0603067 0.7462488 0.8172041 -0.3429001 0.3569308 -0.1794536 0.7625721 0.3145722 0.085795 -0.4572105 -0.0904216 1.3115364 0.0081624 -0.5603836 -0.0583363 1.0208126 -0.0967404 0.0690548 -0.0750147 0.0359132 -0.0806147 -0.0395505 0.0186211 -0.0648308 -0.0546425 -0.1064183 -0.0509542 0.0374621 -0.0036347 -0.0439823 -0.0887573 -0.0268613 -0.0720665 -0.0572975 -0.0499212 -0.0650595 0.0602193 -0.0622198 -0.0139054 -0.1333338 0.0402833 -0.1219269 0.0058537 -0.0102419 0.0516073 -0.0960746 0.0552955 -0.0805894 -0.0974551 -0.1038293 -0.0811427 -0.0225935 0.0871994 -0.0381882 -0.0025722 -0.0476812 -0.1016993 -0.0519408 0.011285 -0.0541856 -0.0891141 0.0250392 0.0355251 0.0498458 0.0594747 -0.0117167 -0.0815308 0.0603414 -0.0752845 0.0288096 0.074312 -0.0267516 0.0318192 -0.0263858 -0.006834 0.090873 0.0224961 0.0755268 0.0665541 0.0355636 -0.0498743 -0.0439237 -0.0700217 0.0595656 -0.0807847 -0.0561805 -0.0473011 0.0232423 0.0280586 0.0464493 0.043755 0.0881743 -0.0032894 -0.0088479 0.0595824 -0.0315131 0.0837584 0.1073372 -0.0297206 0.0627918 -0.0379802 0.1056607 0.0465512 0.0737405 0.0486441 0.0840544 0.0912479 0.0503351 -0.0555559 0.0584327 0.0478156 0.0973705 -0.0505137 0.0902337 0.0438975 0.0412979 0.0512431 -0.0385614 0.0602226 0.0438023 0.1205094 -0.0561062 0.1215563 0.0210834 -0.0164335 -0.0406805 0.0831047 -0.054718 0.0880332 0.0934894 0.096931 0.0898756 0.030893 -0.1244673 0.0517668 -0.0041849 0.0568527 0.1186765 0.0343416 -0.0005301 0.033 0.1196858 0.3528503 0.0391434 0.0652884 -0.0031061 0.2501202 -0.088205 0.0746301 -0.1400735 0.2138482 unknown
polarizability: 159.2782919|-0.4471237|106.8263976|-4.9232797|-19.8151234|104.3983374 unknown
InChI: InChI=1S/C11H10O4/c12-9-6-7-11(15-9,10(13)14)8-4-2-1-3-5-8/h1-5,13H,6-7H2
charge 0 multiplicity 1
25 atoms
O  -1.277768 -0.79368 0.636307
O  -0.348299 2.647814 -0.257468
O  -3.333558 -1.866829 0.483342
O  -1.318876 1.785416 1.671397
C  -0.527596 0.235282 -0.131542
C  -1.153937 0.182249 -1.562957
C  -2.610711 -0.242616 -1.288561
C  0.968012 -0.086362 -0.062533
C  -2.52381 -1.068156 -0.000095
C  -0.797875 1.598201 0.55916
C  1.456469 -0.985423 0.916455
C  1.870053 0.52467 -0.969039
C  2.836984 -1.280843 0.975577
C  3.248321 0.226571 -0.904684
C  3.736406 -0.677953 0.067256
H  -0.627078 -0.593725 -2.144002
H  -1.061815 1.144611 -2.086285
H  -3.066457 -0.84414 -2.089662
H  -3.273338 0.623271 -1.100353
H  0.753407 -1.454192 1.610198
H  1.501634 1.24065 -1.711504
H  3.207637 -1.981362 1.731883
H  3.93955 0.701067 -1.609903
H  4.806437 -0.908208 0.116474
H  -0.458495 3.511286 0.224938
