program: Gaussian 09
title: 000202863
version: EM64L-G09RevD.01
frameworkgroup: C1[X(C16H24N2O2S)]
method: RPBEPBE
basis: SDD
operation: Freq
keyword: #p
keyword: freq=noraman
keyword: PBEPBE/SDD
title: #p freq=noraman PBEPBE/SDD
converged: YES YES NO NO
title: Mulliken charges:
elementType: S O O N N C C C C C C C C C C C C C C C C H H H H H H H H H H H H H H H H H H H H H H H H
charge: 0.945785 -0.544370 -0.537990 -0.106187 -0.201136 0.337528 -0.361512 -0.377353 -0.404380 -0.390186 -0.403559 -0.062711 -0.762668 -0.784053 0.308241 -0.352735 -0.334640 -0.225830 -0.234807 -0.737170 -0.231286 0.230270 0.175156 0.167760 0.224753 0.210252 0.190540 0.190171 0.206770 0.188445 0.215613 0.243462 0.227788 0.232331 0.229694 0.253182 0.254835 0.272010 0.229964 0.233843 0.230170 0.272895 0.277810 0.271889 0.231416
chargesum: 0.00000
title: Mulliken charges with hydrogens summed into heavy atoms:
elementType: S O O N N C C C C C C C C C C C C C C C C
charge: 0.945785 -0.544370 -0.537990 -0.106187 -0.201136 0.337528 0.043915 0.015160 -0.003589 0.006755 0.000500 -0.062711 -0.059087 -0.046342 0.308241 -0.080726 -0.104676 0.008013 -0.004637 0.085423 0.000130
polarizability: 2.69207219e+02 4.80815953e+00 2.19749690e+02 9.68415529e-01 4.66823379e+00 1.86836736e+02
1716.lowfreq: -12.7408 -8.6538 -2.2671 -0.0021 -0.0020 -0.0013 10.7057 32.5687 39.0662
frequency: 4.4763 32.4730 38.7449 43.7913 55.3332 65.4433 87.9490 112.3603 133.1413 142.3493 174.3420 176.1091 192.8872 219.2755 221.4161 244.8515 248.4946 256.9876 271.9392 291.3910 307.6666 317.2833 321.5521 330.0403 350.1302 380.1500 396.3371 418.1392 437.3891 443.4225 443.8948 460.8978 517.9130 575.5227 601.4229 610.9048 618.6079 683.6768 699.1267 704.2687 724.9434 768.7294 803.2813 805.5944 840.0615 850.7512 853.2024 881.7359 888.4585 912.3888 914.8219 918.4618 945.2377 955.8680 966.7115 976.8419 986.2365 988.4661 991.8419 998.7993 1016.6154 1029.3384 1034.0255 1073.0358 1077.8152 1084.9707 1120.9635 1134.3583 1145.9115 1148.0343 1168.1352 1175.7082 1189.0681 1195.7735 1212.5429 1238.3611 1259.5679 1271.9886 1300.6749 1310.4318 1319.4067 1331.5085 1338.0134 1347.5258 1349.8625 1370.0615 1371.1439 1376.3724 1389.0470 1415.3793 1416.0215 1430.1512 1446.9309 1457.8761 1458.1398 1462.3318 1464.2271 1466.7030 1473.6901 1474.3935 1483.7994 1489.1148 1535.6766 1582.6225 1606.6638 2826.7630 2846.0188 2964.3536 2985.9460 2986.7059 2989.7737 2992.1488 3032.8559 3039.3909 3046.4009 3054.3644 3057.6338 3067.0263 3081.1586 3088.4247 3100.0014 3105.5463 3130.0038 3138.9255 3150.7613 3161.1876 3172.6314 3186.8506 3193.8954
redmass: 3.9315 5.7403 3.9685 3.9297 5.0174 4.3019 4.0979 3.8198 6.7404 4.1859 3.5813 1.0589 3.9160 2.5029 3.6489 2.3610 1.9077 1.9392 2.4199 1.4937 2.5003 1.9009 6.0179 3.0858 4.5684 2.1553 2.8589 3.8164 5.8258 2.9476 3.1684 2.5507 2.4211 3.9177 6.4447 6.3202 3.5190 3.9667 3.3753 2.1426 3.4997 2.1325 11.7480 1.4765 2.7953 1.2547 1.4771 2.7956 3.5234 1.8045 1.7123 2.0573 2.2203 1.3319 2.3233 1.4140 1.4992 3.5204 1.3034 1.4083 1.7373 2.2049 2.2757 1.7891 1.7371 1.6280 2.9826 2.1046 2.3175 1.2860 2.1906 1.0592 2.6503 1.1343 3.6776 2.5015 1.2778 1.1716 1.4266 1.1388 1.3673 1.2787 1.4171 1.4374 1.4285 1.2416 6.1814 1.3204 1.1989 1.0526 1.0516 2.2223 1.0911 1.0897 1.0851 1.0824 1.1006 1.0727 1.2600 1.5493 1.0534 1.0706 10.3123 5.8788 6.0143 1.0714 1.0706 1.0630 1.0607 1.0608 1.0356 1.0351 1.0964 1.0250 1.1026 1.0986 1.0917 1.0887 1.0987 1.0975 1.1003 1.1012 1.0849 1.0883 1.0932 1.0966 1.1009 1.1074 1.1070
irintensity: 0.1101 4.1772 1.8008 0.5795 1.5338 1.1495 1.5361 3.3476 6.2197 0.2667 1.4081 0.0006 2.6164 0.4944 1.0758 0.3000 1.3471 0.6892 7.0027 1.3244 7.9006 3.6519 29.5085 3.5399 36.3338 23.5538 1.7195 8.0927 7.0713 2.3809 5.7323 1.4740 3.1057 28.8408 44.4236 0.1702 0.4945 13.8515 5.0783 43.6487 9.7626 39.0053 60.1174 0.0308 0.4497 2.7653 9.2245 14.7456 31.3876 6.3836 3.2187 6.7469 7.0727 4.1378 28.0952 0.4494 34.0169 6.5378 1.6898 1.3341 44.4397 4.1292 8.5390 13.2733 8.1379 5.9347 6.4136 6.8419 9.8515 6.8933 34.0891 0.4568 91.2143 1.7622 4.8438 34.5714 0.4076 11.9195 1.5616 4.1420 0.5788 3.5206 0.6727 1.2118 1.4245 21.9932 0.4314 13.6956 11.4429 12.8747 11.9316 10.3579 5.4143 7.8637 10.4344 2.9880 4.6059 3.3648 8.0170 9.0671 17.3842 13.1237 47.0305 1.5807 0.1159 92.0589 126.3234 41.8849 48.3495 31.2994 15.1753 19.3651 73.6972 0.4701 30.2065 51.3817 46.3292 32.8398 15.1890 39.2748 17.0337 17.4219 0.4108 3.4143 26.5921 20.6558 10.3428 1.2916 0.9172
temp: 298.150 k
press: 1.00000 atm
elementType: 16 8 8 7 7 6 6 6 6 6 6 6 6 6 6 6 6 6 6 6 6 1 1 1 1 1 1 1 1 1 1 1 1 1 1 1 1 1 1 1 1 1 1 1 1
symmnumber: 1
zpe: 975239.4 jmol-1
zpe.correction: 0.371449 hartree
zpe.thermalcorrener: 0.394260 hartree
zpe.thermalcorrenthalpy: 0.395204 hartree
zpe.thermalcorrgfe: 0.317228 hartree
zpe.sumelectzpe: -1280.297851 hartree
zpe.sumelectthermal: -1280.275040 hartree
zpe.sumelectthermalent: -1280.274095 hartree
zpe.sumelectthermalfe: -1280.352072 hartree
dipole: 4.1263 -2.8394 -0.0901
dipole: 5.0097
quadrupole: -135.9776 -125.8595 -134.4255
quadrupole: 12.2763 -0.0777 0.2669
quadrupole: -3.8901 6.2281 -2.3380 12.2763 -0.0777 0.2669
hfenergy: -1280.6692998 hartree
pointgroup: C01 [X(C16H24N2O2S1)]
dipole: -1.5426215 1.226348 -0.0321554 debye
polarizability: 269.6515449|1.4672365|219.514615|0.05361|-3.8317642|186.6274851 unknown
InChI: InChI=1S/C16H24N2O2S/c1-16(2,18-12-8-5-9-13-18)15(17-21(3,19)20)14-10-6-4-7-11-14/h4,6-7,10-11H,5,8-9,12-13H2,1-3H3
charge 0 multiplicity 1
45 atoms
S  1.384195 -2.462193 0.111477
O  2.273654 -2.59402 1.476873
O  2.119868 -2.390478 -1.344674
N  -2.212232 0.513214 0.212675
N  -0.09147 -1.126766 0.32201
C  -0.900993 1.168346 0.510136
C  -2.42813 0.186234 -1.220688
C  -3.421551 1.139923 0.800489
C  -3.587518 -0.818426 -1.378032
C  -4.629695 0.180449 0.698467
C  -4.884496 -0.244797 -0.764774
C  0.253848 0.134115 0.240022
C  -0.690244 2.497219 -0.27872
C  -0.761549 1.464979 2.033814
C  1.653372 0.639252 0.02193
C  2.600568 0.574358 1.077153
C  2.049986 1.142991 -1.243507
C  3.919535 1.034006 0.870756
C  3.372752 1.586934 -1.447017
C  0.181683 -3.932239 0.081516
C  4.309196 1.542824 -0.387972
H  -1.502367 -0.247868 -1.634076
H  -2.669054 1.104378 -1.8167
H  -3.68496 2.101089 0.284499
H  -3.239217 1.372354 1.862133
H  -3.311489 -1.756488 -0.859661
H  -3.731777 -1.049972 -2.451204
H  -5.52377 0.677241 1.123217
H  -4.417317 -0.716152 1.311876
H  -5.209574 0.637791 -1.354565
H  -5.703673 -0.986632 -0.816155
H  0.249586 2.997121 0.008215
H  -0.674376 2.339452 -1.370529
H  -1.528224 3.17964 -0.045853
H  -1.384833 2.328019 2.325693
H  -1.057648 0.580024 2.622031
H  0.283947 1.721634 2.276362
H  2.317994 0.144634 2.042892
H  1.337562 1.15865 -2.074947
H  4.64491 0.972192 1.688842
H  3.674672 1.955239 -2.433351
H  0.81224 -4.82754 -0.007747
H  -0.374215 -3.896289 1.026874
H  -0.470007 -3.786262 -0.789577
H  5.336709 1.887218 -0.548404
