program: Gaussian 09
title: 000202824
version: EM64L-G09RevD.01
frameworkgroup: C1[X(C21H25NO)]
method: RPBEPBE
basis: SDD
operation: Freq
keyword: #p
keyword: freq=noraman
keyword: PBEPBE/SDD
title: #p freq=noraman PBEPBE/SDD
converged: YES YES NO NO
title: Mulliken charges:
elementType: O N C C C C C C C C C C C C C C C C C C C C C H H H H H H H H H H H H H H H H H H H H H H H H H
charge: -0.284206 -0.092976 -0.589019 -0.088655 -0.561115 -0.507964 0.372843 0.405866 0.388445 0.403217 -0.340618 -0.467825 -0.484790 -0.474917 -0.483644 -0.240051 -0.238463 -0.237754 -0.236983 -0.236597 -0.366999 -0.612549 -0.613804 0.276536 0.259297 0.243619 0.230192 0.237115 0.198568 0.211456 0.245709 0.244992 0.241123 0.239344 0.223308 0.222557 0.222751 0.222580 0.204530 0.183054 0.194435 0.218180 0.227297 0.188073 0.220651 0.221836 0.222737 0.188620
chargesum: 0.00000
title: Mulliken charges with hydrogens summed into heavy atoms:
elementType: O N C C C C C C C C C C C C C C C C C C C C C
charge: -0.284206 -0.092976 -0.312483 0.170642 -0.317496 -0.040658 0.372843 0.405866 0.388445 0.403217 0.069406 -0.222116 -0.239799 -0.233794 -0.244299 -0.016743 -0.015907 -0.015003 -0.014403 0.150987 0.045616 0.023472 0.019389
polarizability: 2.55309973e+02 1.67717538e+01 2.36529430e+02 -2.05254958e+01 8.42291609e+00 1.88277244e+02
1716.lowfreq: -10.3493 -0.0006 -0.0005 0.0008 4.8516 9.3237 20.0410 25.4323 34.3202
frequency: 19.6281 25.1097 33.8291 57.9793 69.1959 77.4841 102.7654 128.8634 136.3540 140.9403 154.1231 199.1766 216.1305 223.4735 234.5320 269.6829 307.3138 321.3561 347.3881 348.5709 368.5144 389.3989 413.7178 425.9228 449.1497 468.6733 482.9309 506.0911 520.3317 551.2351 577.7611 605.4819 622.6506 641.4552 710.9885 752.2657 756.6961 760.9780 773.0398 784.1554 797.3666 809.6864 818.0440 830.2684 845.4283 874.5664 879.4983 900.0469 918.5666 927.6651 942.2894 943.4590 959.2933 982.4352 983.2419 1011.9975 1022.8176 1023.3904 1028.0692 1034.4904 1051.2447 1058.7082 1068.3231 1075.8178 1088.3721 1096.1663 1108.7060 1119.0149 1139.6884 1157.4049 1167.0031 1169.4073 1170.7932 1172.0344 1173.1988 1189.3334 1197.7717 1206.4715 1214.6150 1218.7606 1221.1971 1237.3895 1265.6961 1271.2708 1280.8002 1285.9597 1295.0682 1318.1398 1319.8094 1332.1440 1339.0632 1364.1046 1392.6912 1395.7861 1403.9987 1420.5554 1443.5703 1443.6148 1451.0700 1461.5777 1462.6910 1463.4689 1466.2793 1468.5639 1476.1785 1478.3342 1482.0380 1485.7268 1490.9572 1592.3235 1598.0103 1612.2217 1620.6930 2846.1298 2856.1760 2878.1571 2910.1272 2933.0426 2962.6880 2989.3821 2989.7088 3018.3669 3021.3478 3027.6114 3044.9805 3045.4884 3059.4521 3074.9180 3077.6738 3085.2323 3116.3367 3116.9655 3123.4942 3124.1855 3137.2904 3138.0089 3157.5548 3158.2237
redmass: 4.4581 2.6448 4.3397 4.2999 4.3090 1.8994 3.7114 3.8975 3.7749 3.8438 3.4947 3.0096 2.2588 1.1781 1.4733 2.2036 3.5521 3.0491 3.6771 2.6509 4.3014 2.7782 3.0408 3.7565 3.1889 3.2930 3.5351 4.3679 4.2247 3.6162 3.7567 4.0222 4.6030 6.4457 4.9631 1.7010 2.9514 1.4890 2.7424 3.7691 2.7614 1.6793 2.0876 2.4315 3.0563 1.4622 1.6995 3.0073 2.7580 3.0646 1.4447 1.4960 2.8971 1.3172 1.3185 2.2141 2.2713 2.2141 2.6030 1.5724 3.9427 3.5247 1.7490 2.2698 1.4757 2.0605 1.7735 1.6161 1.4452 1.2867 1.4915 1.0915 1.0915 2.4769 1.7847 1.2469 1.2966 1.7235 1.6724 1.9174 1.3929 1.7102 2.4638 1.9477 1.3626 1.2686 1.3570 1.4317 1.3144 1.4529 1.4008 1.4036 7.2413 5.9078 1.4464 1.1539 1.1910 2.2725 2.4761 1.0599 2.2094 1.1562 1.0825 1.0832 1.0531 1.0923 2.4134 1.0578 1.0772 6.1641 7.1446 6.9877 7.1649 1.0572 1.0594 1.0679 1.0558 1.0566 1.1037 1.1008 1.0629 1.0722 1.0878 1.0722 1.0879 1.0914 1.1008 1.0880 1.1008 1.1003 1.0855 1.0855 1.0892 1.0892 1.0941 1.0941 1.1003 1.1003
irintensity: 0.0508 0.3489 0.0107 0.6207 0.4092 3.8686 0.0261 2.7627 3.0413 1.4534 2.2366 1.3520 0.3074 0.5788 0.0896 1.9145 0.9835 1.1279 4.0419 8.8094 0.0248 0.0891 4.3369 3.9350 3.8445 0.7383 1.3714 1.1606 1.3450 35.7348 0.2619 1.0571 8.1905 3.4486 2.6535 13.5112 7.5375 93.5818 14.9715 3.5432 6.3907 10.9239 10.0310 0.5650 0.5151 0.5051 0.4581 0.6052 11.6284 1.6142 0.0588 0.8591 5.2639 0.0046 0.0093 1.0917 4.3794 6.9186 0.3540 22.2094 225.2134 22.6655 36.5068 14.6139 5.5988 4.8919 8.9875 3.8052 3.3812 6.3071 2.2373 0.0506 1.0429 7.2444 7.6620 0.5626 3.1846 6.6455 1.8595 8.2015 1.7572 7.1525 12.1725 4.1121 1.9283 5.1050 2.3949 0.2168 14.0239 0.6125 1.6353 6.4884 0.0329 0.5499 2.6027 2.3293 1.8617 11.6471 0.2739 11.4309 41.3820 10.4572 3.0248 18.3395 15.2351 12.0818 10.6941 8.3838 7.8745 2.0085 0.0164 0.0285 0.2593 69.8948 140.3080 134.2013 34.2968 82.7188 39.1079 38.2524 47.0772 42.2796 24.7820 50.7096 34.2951 33.9690 44.3378 9.1137 36.2577 49.1402 2.5071 5.4990 3.2586 2.8356 19.0360 47.6729 57.1495 23.1312
temp: 298.150 k
press: 1.00000 atm
elementType: 8 7 6 6 6 6 6 6 6 6 6 6 6 6 6 6 6 6 6 6 6 6 6 1 1 1 1 1 1 1 1 1 1 1 1 1 1 1 1 1 1 1 1 1 1 1 1 1
symmnumber: 1
zpe: 1069965.9 jmol-1
zpe.correction: 0.407528 hartree
zpe.thermalcorrener: 0.428389 hartree
zpe.thermalcorrenthalpy: 0.429334 hartree
zpe.thermalcorrgfe: 0.356164 hartree
zpe.sumelectzpe: -943.497453 hartree
zpe.sumelectthermal: -943.476592 hartree
zpe.sumelectthermalent: -943.475648 hartree
zpe.sumelectthermalfe: -943.548817 hartree
dipole: 1.1852 -0.0532 1.2855
dipole: 1.7493
quadrupole: -126.0016 -134.9745 -130.8979
quadrupole: -2.9305 -6.0754 2.6859
quadrupole: 4.6231 -4.3498 -0.2732 -2.9305 -6.0754 2.6859
hfenergy: -943.9049818 hartree
pointgroup: C01 [X(C21H25N1O1)]
dipole: -0.4674781 -0.0231124 -0.504562 debye
polarizability: 255.5537748|-16.4723674|236.2643678|-20.7181397|-8.3267683|188.2985041 unknown
InChI: InChI=1S/C21H25NO/c1-22(2)11-12-23-14-15-13-20-16-7-3-5-9-18(16)21(15)19-10-6-4-8-17(19)20/h3-10,15,20-21H,11-14H2,1-2H3
charge 0 multiplicity 1
48 atoms
O  -2.248059 -0.606975 -0.513832
N  -5.902218 -0.260709 0.241499
C  0.585454 -0.43476 0.340294
C  0.096056 -0.657418 -1.149887
C  2.434541 0.409564 -1.318274
C  1.188776 -0.113114 -2.133717
C  0.897743 1.050259 0.493236
C  1.898133 -1.203649 0.460579
C  1.905974 1.508804 -0.39996
C  2.901165 -0.749178 -0.440115
C  -1.262839 0.002961 -1.414065
C  0.283833 1.947301 1.388274
C  2.162937 -2.276261 1.332833
C  2.300522 2.860151 -0.394207
C  4.166563 -1.364865 -0.465243
C  0.684698 3.307096 1.39994
C  3.438186 -2.895677 1.311202
C  1.688979 3.761512 0.513375
C  4.435413 -2.44201 0.416733
C  -3.590501 -0.040223 -0.688034
C  -4.512064 -0.772189 0.298186
C  -6.655504 -0.534606 1.482102
C  -6.641454 -0.714088 -0.954796
H  -0.187306 -0.784014 1.043179
H  -0.027185 -1.747431 -1.289095
H  3.22545 0.770662 -1.998324
H  0.788513 0.723216 -2.738361
H  1.512126 -0.906246 -2.830846
H  -1.567908 -0.160567 -2.473026
H  -1.206581 1.09976 -1.233282
H  -0.497271 1.59377 2.071477
H  1.388743 -2.627627 2.025109
H  3.077999 3.212658 -1.082597
H  4.940063 -1.012687 -1.158357
H  0.216697 4.009021 2.099567
H  3.653572 -3.727173 1.991933
H  1.996495 4.813366 0.530034
H  5.420089 -2.923224 0.407839
H  -3.590785 1.048041 -0.466299
H  -3.921584 -0.1812 -1.7408
H  -4.450739 -1.872302 0.103901
H  -4.117176 -0.601242 1.316191
H  -6.119573 -0.105642 2.347184
H  -6.813494 -1.626177 1.678363
H  -7.649317 -0.054493 1.4249
H  -6.112418 -0.411054 -1.874388
H  -7.639986 -0.241858 -0.971618
H  -6.782658 -1.825286 -0.987504
