program: Gaussian 09
title: 000202809
version: EM64L-G09RevD.01
frameworkgroup: C1[X(C17H20ClN)]
method: RPBEPBE
basis: SDD
operation: Freq
keyword: #p
keyword: freq=noraman
keyword: PBEPBE/SDD
title: #p freq=noraman PBEPBE/SDD
converged: YES YES NO NO
title: Mulliken charges:
elementType: Cl N C C C C C C C C C C C C C C C C C H H H H H H H H H H H H H H H H H H H H
charge: -0.061417 -0.080656 -0.063943 -0.579993 -0.501729 -0.736904 0.500025 -0.640044 0.595967 -0.432552 -0.401993 -0.317746 -0.403148 -0.231289 -0.234493 -0.230352 -0.243470 -0.244569 -0.228980 0.230539 0.201728 0.241185 0.235069 0.194533 0.221521 0.212768 0.247414 0.222975 0.248354 0.182032 0.231236 0.235866 0.240916 0.222703 0.222552 0.254055 0.231032 0.226443 0.234366
chargesum: 0.00000
title: Mulliken charges with hydrogens summed into heavy atoms:
elementType: Cl N C C C C C C C C C C C C C C C C C
charge: -0.061417 -0.080656 0.166597 -0.137080 -0.072127 -0.055201 0.500025 0.013316 0.595967 -0.201317 -0.166126 -0.317746 -0.162231 -0.008586 -0.011941 0.023703 -0.012438 -0.018127 0.005386
polarizability: 2.78571216e+02 -1.23559555e+01 1.62417844e+02 -6.30189094e+00 -1.15723447e+01 1.45252603e+02
1716.lowfreq: -13.3308 -4.1786 -0.0018 -0.0004 0.0004 5.2675 12.4883 24.4655 35.8200
frequency: 8.8970 24.4144 35.8173 49.8372 70.7884 80.4176 99.1725 147.6460 157.9275 193.2988 208.7076 218.6578 238.8370 256.7584 292.4236 295.2426 349.2677 363.0146 396.0206 403.2910 423.9214 435.0126 455.1149 481.7658 512.8753 535.9672 581.6592 617.9790 623.3048 664.4050 704.2300 715.5147 748.6621 757.7699 784.5636 822.0613 828.9638 851.3401 854.9698 871.6741 891.4093 916.7111 944.5504 954.1850 974.2425 975.1255 984.7470 990.0154 992.8444 1020.3870 1027.1549 1039.7747 1043.5873 1045.8537 1091.2186 1101.6690 1122.0536 1123.4741 1140.0173 1170.8944 1171.1660 1186.7987 1191.0799 1208.6258 1216.7653 1218.4367 1256.6856 1287.5428 1301.6428 1312.5546 1332.5270 1348.5236 1369.0785 1376.7428 1378.9905 1382.8397 1423.6314 1433.4386 1439.9948 1455.4676 1460.6278 1467.1742 1470.5578 1476.3403 1480.4633 1484.9644 1491.7450 1575.8530 1592.0699 1604.5003 1613.9383 2850.1399 2859.2488 2976.3669 2981.3069 2994.4653 3023.9402 3045.4901 3060.5305 3069.8683 3080.3678 3081.3296 3112.8524 3115.1747 3121.5951 3130.4426 3139.7357 3141.3650 3157.3431 3160.4444 3173.0950
redmass: 4.0349 5.6880 5.8000 3.3941 3.8119 4.3179 3.5942 5.0383 4.3659 2.6052 1.1331 1.5184 2.8859 2.4256 3.5264 3.5074 5.1859 2.0116 2.6660 2.8159 3.7594 2.9733 3.2985 3.3263 3.5864 3.0166 5.4452 6.1128 4.3030 6.0447 1.9468 3.3641 1.8226 1.4071 2.9260 3.2807 3.0484 1.6597 1.7505 1.4941 1.4092 1.4556 1.5079 1.7416 1.8290 1.4394 1.3294 5.8568 1.3284 6.6748 2.1876 2.0154 1.7326 2.1694 1.6035 1.4996 2.1368 1.7433 1.7878 1.0636 1.0669 1.1146 1.6925 2.3655 2.4557 1.5170 1.6526 1.4284 1.4475 1.3545 1.2632 1.3073 1.3122 1.6932 2.9587 5.7909 2.0659 1.1734 2.1592 1.4279 1.1376 1.3782 1.1053 1.0755 1.2843 1.7473 1.0533 6.0761 6.0149 7.2042 6.1565 1.0655 1.0628 1.0369 1.0775 1.0659 1.0713 1.0865 1.1002 1.0994 1.0988 1.1007 1.0866 1.0866 1.0878 1.0910 1.0888 1.0959 1.0946 1.1015 1.0996
irintensity: 0.0394 0.1175 0.2681 0.0350 0.1653 0.7371 0.4390 0.5441 0.2068 0.7171 0.2322 0.1760 1.3199 4.3773 0.2843 1.1061 0.8493 0.3294 6.2353 0.0063 4.5337 1.3583 7.7229 0.5271 12.4758 4.0781 2.4407 0.4888 13.9058 18.1482 40.6339 17.2722 59.4461 53.8313 21.7294 4.0013 4.8931 1.0363 1.8622 2.1700 4.1863 1.0681 5.7319 10.6810 11.8065 1.6650 0.0417 0.0974 0.3193 56.9638 8.5081 5.6744 2.7252 39.8971 13.1165 10.3722 20.2601 18.6185 42.8819 1.2782 1.2762 0.0697 24.9588 4.1477 0.5445 13.6937 12.3399 8.8809 17.3364 2.0077 2.0235 4.0033 6.2105 33.0622 7.2579 1.0993 23.0077 6.4594 7.7021 8.3153 21.4325 23.0066 3.2757 7.7955 24.7783 11.1642 5.1270 10.5160 1.4849 2.3126 14.3875 49.6983 145.6801 20.7369 4.3295 41.5571 36.7596 8.1038 10.9658 39.9370 33.4626 44.4158 9.2393 6.4234 5.8036 12.5832 8.7151 46.5932 18.8731 27.2923 16.2166
temp: 298.150 k
press: 1.00000 atm
elementType: 17 7 6 6 6 6 6 6 6 6 6 6 6 6 6 6 6 6 6 1 1 1 1 1 1 1 1 1 1 1 1 1 1 1 1 1 1 1 1
symmnumber: 1
zpe: 849336.5 jmol-1
zpe.correction: 0.323495 hartree
zpe.thermalcorrener: 0.342089 hartree
zpe.thermalcorrenthalpy: 0.343033 hartree
zpe.thermalcorrgfe: 0.273660 hartree
zpe.sumelectzpe: -1173.206894 hartree
zpe.sumelectthermal: -1173.188300 hartree
zpe.sumelectthermalent: -1173.187356 hartree
zpe.sumelectthermalfe: -1173.256729 hartree
dipole: -1.3033 2.0649 -0.1013
dipole: 2.4439
quadrupole: -104.7182 -121.1110 -118.0953
quadrupole: -1.7286 -1.0856 -1.9997
quadrupole: 9.9233 -6.4695 -3.4538 -1.7286 -1.0856 -1.9997
hfenergy: -1173.5303894 hartree
pointgroup: C01 [X(C17H20Cl1N1)]
dipole: -0.5277017 0.8016943 0.0574089 debye
polarizability: 279.0076323|-9.3810436|164.5793094|-7.0833989|-9.3291991|142.6547216 unknown
InChI: InChI=1S/C17H20ClN/c1-14(12-15-8-4-3-5-9-15)19(2)13-16-10-6-7-11-17(16)18/h3-11,14H,12-13H2,1-2H3
charge 0 multiplicity 1
39 atoms
Cl -1.728529 -2.33652 -0.44905
N  -0.620458 0.87077 0.576102
C  0.85087 1.023481 0.346705
C  1.441652 -0.24807 -0.338291
C  -1.450177 0.839289 -0.653654
C  1.257651 2.321636 -0.404292
C  2.953709 -0.344804 -0.197419
C  -1.15293 1.787625 1.602268
C  -2.837323 0.258321 -0.406938
C  3.820455 -0.03795 -1.277647
C  3.533809 -0.73733 1.038495
C  -3.092033 -1.12761 -0.27452
C  -3.960735 1.12112 -0.302923
C  5.224775 -0.115797 -1.130423
C  4.935474 -0.816793 1.191905
C  -4.37834 -1.649565 -0.035189
C  -5.262677 0.629421 -0.06348
C  5.788053 -0.5045 0.106548
C  -5.472046 -0.761036 0.074796
H  1.293864 1.065651 1.362582
H  1.170309 -0.258367 -1.411521
H  0.950709 -1.117923 0.13483
H  -0.927641 0.218091 -1.40176
H  -1.581256 1.858477 -1.097603
H  0.864531 3.221221 0.103825
H  0.880416 2.318716 -1.444389
H  2.357619 2.40954 -0.446154
H  -0.515302 1.739191 2.50258
H  -2.171569 1.475619 1.891217
H  -1.207696 2.85649 1.273054
H  3.390069 0.258659 -2.242461
H  2.878028 -0.994075 1.880388
H  -3.796433 2.199947 -0.414453
H  5.87682 0.122114 -1.978858
H  5.363313 -1.127978 2.1520
H  -4.522032 -2.730222 0.055879
H  -6.105673 1.324248 0.01296
H  6.875873 -0.569011 0.222458
H  -6.475447 -1.158775 0.260327
