program: Gaussian 09
title: 000202794
version: EM64L-G09RevD.01
frameworkgroup: C1[X(C8H20N2)]
method: RPBEPBE
basis: SDD
operation: Freq
keyword: #pfreq=noraman
keyword: PBEPBE/SDD
title: #p freq=noraman PBEPBE/SDD
converged: YES YES NO NO
title: Mulliken charges:
elementType: N N C C C C C C C C H H H H H H H H H H H H H H H H H H H H
charge: -0.305375 -0.564866 0.019757 -0.457852 -0.375881 -0.049383 -0.748018 -0.366930 -0.697101 -0.696117 0.164475 0.187454 0.215339 0.191013 0.185746 0.177539 0.206820 0.217418 0.218727 0.202824 0.193129 0.205280 0.225351 0.204339 0.268004 0.210860 0.216458 0.207952 0.250844 0.292196
chargesum: 0.00000
title: Mulliken charges with hydrogens summed into heavy atoms:
elementType: N N C C C C C C C C
charge: -0.037371 -0.021826 0.184232 -0.055059 0.000878 0.128156 -0.105054 0.029023 -0.062131 -0.060847
polarizability: 1.16738559e+02 2.47188352e+00 1.00716704e+02 -7.69967207e-01 -8.75453207e-02 9.17345088e+01
1716.lowfreq: -18.7337 -10.1160 -0.0004 0.0004 0.0006 9.3440 30.2060 55.3583 71.4421
frequency: 29.8123 55.1420 71.3043 92.7082 106.6080 162.2049 185.8574 211.8896 231.9744 239.8807 252.9027 303.5649 318.4535 350.9494 368.8326 419.3860 457.0085 512.7442 526.9044 620.2401 709.6347 733.1966 807.9935 836.5377 853.9397 893.3524 894.8261 931.0064 972.0838 987.0033 1026.0070 1052.2392 1075.3266 1086.9582 1090.5177 1142.0934 1156.9708 1161.9196 1172.0778 1212.1292 1230.6964 1251.6353 1266.7229 1285.4877 1292.4021 1314.4063 1328.0639 1340.6032 1347.5741 1351.7168 1381.9304 1387.4543 1390.3985 1451.0936 1456.7738 1458.9569 1469.2057 1472.5571 1475.4778 1476.7777 1479.1611 1481.4286 1487.3329 1660.5126 2833.3420 2932.6440 2949.9393 2968.1964 2970.4445 2971.4119 2972.4072 2976.8681 2999.2541 3028.3722 3029.3618 3061.6814 3068.1795 3071.2895 3071.5056 3075.6793 3082.4637 3340.6855 3435.7839 3540.0177
redmass: 3.2896 1.8288 2.3562 2.8962 2.3911 2.1270 1.7595 1.2167 1.1368 1.2877 2.5351 2.4876 2.3500 1.4486 2.3019 2.3521 2.1884 2.2884 1.8772 2.1466 1.3067 1.1237 1.9665 1.5998 1.3857 1.5611 1.9344 1.8833 1.6163 1.2810 2.0125 1.8670 2.2359 2.0808 2.2773 2.3557 2.3266 2.2426 2.0985 1.3788 1.3629 1.3120 1.2514 1.2784 1.1055 1.3895 1.3606 1.3307 1.5615 1.5199 1.2276 1.2091 1.2142 1.0785 1.1223 1.0796 1.0898 1.0664 1.0549 1.0450 1.0461 1.0491 1.0741 1.0658 1.0807 1.0807 1.0611 1.0467 1.0536 1.0441 1.0464 1.0371 1.0973 1.1013 1.1018 1.0987 1.1008 1.0988 1.0992 1.0986 1.1002 1.0497 1.0756 1.0910
irintensity: 0.8501 0.0398 0.7598 0.0225 1.9743 1.4662 0.0532 0.2046 0.3264 1.1443 3.4537 2.1670 2.8323 14.4951 3.0768 1.1469 11.0559 0.6763 55.0132 172.5217 84.2202 11.6747 13.1517 15.9177 1.7391 5.4536 3.2067 4.4831 8.7981 2.8514 1.1971 2.8100 3.2012 1.3202 3.6104 7.7449 7.6409 4.0787 2.0233 4.2869 14.4179 1.4650 1.4458 1.0829 0.3726 0.0989 1.8660 13.6308 5.3349 5.8326 18.3958 11.3863 15.7959 4.9225 19.2539 1.9304 6.4404 0.5288 8.9582 11.8803 12.3832 2.3267 18.4292 19.3159 92.9058 18.5726 20.7862 6.4220 72.5216 44.0837 31.1380 42.0100 9.8702 27.6754 39.3041 44.1922 78.6720 53.8401 37.5522 60.0927 38.7683 23.6062 2.6368 0.7260
temp: 298.150 k
press: 1.00000 atm
elementType: 7 7 6 6 6 6 6 6 6 6 1 1 1 1 1 1 1 1 1 1 1 1 1 1 1 1 1 1 1 1
symmnumber: 1
zpe: 719147.5 jmol-1
zpe.correction: 0.273909 hartree
zpe.thermalcorrener: 0.287670 hartree
zpe.thermalcorrenthalpy: 0.288614 hartree
zpe.thermalcorrgfe: 0.233291 hartree
zpe.sumelectzpe: -425.446349 hartree
zpe.sumelectthermal: -425.432588 hartree
zpe.sumelectthermalent: -425.431644 hartree
zpe.sumelectthermalfe: -425.486967 hartree
dipole: 1.0004 -0.5703 1.3388
dipole: 1.7659
quadrupole: -67.7994 -64.4354 -69.1483
quadrupole: 2.7737 -5.1115 -1.2354
quadrupole: -0.6717 2.6923 -2.0206 2.7737 -5.1115 -1.2354
hfenergy: -425.7202575 hartree
pointgroup: C01 [X(C8H20N2)]
dipole: -0.3382741 0.1463808 0.5889478 debye
polarizability: 116.6691806|2.6007284|100.5647575|-1.3687349|1.0651851|91.9558341 unknown
InChI: InChI=1S/C8H20N2/c1-4-5-7(2)6-8(3)10-9/h7-8,10H,4-6,9H2,1-3H3
charge 0 multiplicity 1
30 atoms
N  2.174859 0.369901 -1.102016
N  2.848655 1.623143 -1.282608
C  -0.727775 -0.775145 -0.423978
C  0.666819 -1.103058 0.186797
C  -1.598214 0.047347 0.566201
C  1.664365 0.079201 0.271691
C  -1.432981 -2.084864 -0.8528
C  -2.894467 0.634212 -0.039686
C  2.843895 -0.242609 1.210586
C  -3.678408 1.503747 0.967563
H  -0.582658 -0.154481 -1.336882
H  0.514947 -1.513862 1.205468
H  1.155528 -1.90198 -0.407739
H  -0.996424 0.884962 0.975456
H  -1.857586 -0.599563 1.431952
H  1.132051 0.977069 0.683062
H  -1.583415 -2.746955 0.022236
H  -0.825496 -2.638579 -1.592581
H  -2.421867 -1.893162 -1.30595
H  -3.548566 -0.183901 -0.399812
H  -2.635491 1.242447 -0.930879
H  2.492712 -0.381227 2.249793
H  3.350511 -1.167079 0.878952
H  3.586996 0.576442 1.209447
H  1.435071 0.287212 -1.811728
H  -3.969493 0.914106 1.857518
H  -4.601421 1.913367 0.517471
H  -3.065603 2.35616 1.317477
H  2.440022 2.414939 -0.758004
H  3.857934 1.532313 -1.136311
