program: Gaussian 09
title: 000202761
version: EM64L-G09RevD.01
frameworkgroup: C1[X(C9H11ClN4O)]
method: RPBEPBE
basis: SDD
operation: Freq
keyword: #p
keyword: freq=noraman
keyword: PBEPBE/SDD
title: #p freq=noraman PBEPBE/SDD
converged: YES YES NO NO
title: Mulliken charges:
elementType: Cl O N N N N C C C C C C C C C H H H H H H H H H H H
charge: -0.020683 -0.245757 -0.129443 -0.078331 -0.054524 -0.072856 -0.401856 -0.418584 -0.404198 -0.402685 0.275128 -0.108002 -0.416585 0.312580 -0.505273 0.241114 0.256531 0.243817 0.248307 0.241128 0.247129 0.241343 0.241141 0.233586 0.241582 0.235390
chargesum: 0.00000
title: Mulliken charges with hydrogens summed into heavy atoms:
elementType: Cl O N N N N C C C C C C C C C
charge: -0.020683 -0.245757 -0.129443 -0.078331 -0.054524 -0.072856 0.095790 0.073540 0.084059 0.079799 0.275128 -0.108002 -0.416585 0.312580 0.205286
polarizability: 1.97960147e+02 -6.86190451e-01 1.71961663e+02 -4.23198169e+00 1.25180042e+00 7.51106931e+01
1716.lowfreq: -6.5709 -2.8836 -0.0015 -0.0009 -0.0001 7.8942 50.1403 65.6062 82.4803
frequency: 50.1186 65.5953 82.4668 90.0083 122.6879 139.8682 142.1517 160.0510 167.1924 177.9141 238.7347 260.2236 273.4727 318.9894 349.1951 374.6727 422.4593 474.6565 503.7068 613.1336 648.3984 679.7705 688.5639 751.4406 773.1058 792.8732 797.0255 829.1616 894.8294 914.9866 930.9237 955.1010 997.7433 1001.8566 1024.7474 1053.6130 1094.2656 1095.0525 1100.4255 1101.5261 1111.4841 1119.3587 1121.0315 1136.3085 1140.7349 1149.7045 1218.3017 1255.7195 1303.6954 1328.3083 1417.1440 1444.9736 1449.5412 1463.1708 1463.9893 1464.5174 1471.1804 1479.0353 1488.8318 1519.6235 1527.6664 3003.5073 3076.4043 3080.8394 3084.2509 3088.3854 3106.4924 3144.3532 3179.5603 3185.4156 3195.6460 3201.3892
redmass: 5.4882 3.1294 3.0422 4.1725 1.8411 2.1926 2.1403 2.8085 4.4486 4.9005 6.9600 4.0290 5.1942 9.9343 8.7070 4.6403 4.6217 5.8903 8.6691 8.0632 10.8433 6.5681 10.0899 8.6433 5.9893 1.0733 1.0648 5.3513 6.7768 6.0713 5.5288 4.8970 1.1174 1.2166 2.8226 3.8849 1.3171 1.3080 1.3312 1.3315 1.2524 1.5102 1.6541 1.4559 1.4590 1.5512 4.4966 5.1480 10.2908 5.4064 1.8232 3.2377 1.0632 1.0808 1.1007 1.0819 1.9058 1.2368 1.9352 9.4734 8.3434 1.0290 1.0483 1.0486 1.0605 1.0605 1.1045 1.1050 1.1187 1.1188 1.1175 1.1175
irintensity: 1.3346 2.5218 10.0962 6.6115 2.0321 1.4500 0.5502 3.0481 1.9143 6.7231 6.4979 13.4271 17.5484 2.5468 4.5457 12.1055 5.0110 4.7620 2.9356 24.5364 3.1034 3.8096 2.6430 28.9770 16.9538 24.7009 25.4874 1.8554 0.7740 3.9762 1.9471 60.5974 7.7921 4.2521 29.6316 119.5938 1.1277 3.4011 5.6916 7.4223 0.2110 18.6734 65.0822 1.5530 0.5160 35.1477 15.8289 43.3804 59.8801 174.8156 124.5357 516.5152 17.9876 11.1147 72.6294 4.0020 46.5544 81.3369 30.4551 371.1737 767.8249 47.0784 18.8282 14.8788 52.7621 37.3679 27.9171 21.8626 1.3698 1.1441 31.9403 25.3100
temp: 298.150 k
press: 1.00000 atm
elementType: 17 8 7 7 7 7 6 6 6 6 6 6 6 6 6 1 1 1 1 1 1 1 1 1 1 1
symmnumber: 1
zpe: 511841.8 jmol-1
zpe.correction: 0.194950 hartree
zpe.thermalcorrener: 0.209682 hartree
zpe.thermalcorrenthalpy: 0.210626 hartree
zpe.thermalcorrgfe: 0.152414 hartree
zpe.sumelectzpe: -1102.618635 hartree
zpe.sumelectthermal: -1102.603903 hartree
zpe.sumelectthermalent: -1102.602959 hartree
zpe.sumelectthermalfe: -1102.661172 hartree
dipole: -1.8590 -1.2389 0.2129
dipole: 2.2441
quadrupole: -81.4718 -83.9170 -95.2815
quadrupole: -7.9299 6.2594 0.3791
quadrupole: 5.4183 2.9731 -8.3914 -7.9299 6.2594 0.3791
hfenergy: -1102.8135855 hartree
pointgroup: C01 [X(C9H11Cl1N4O1)]
dipole: -0.5103081 -0.7190678 -0.0454454 debye
dipolederiv: -0.2206536 -0.2936199 -0.0135399 -0.327742 -0.6655411 -0.0306873 -0.0261512 -0.0522128 -0.0225851 -1.7201881 0.4357566 -0.0044552 0.2108248 -0.4157521 0.0093244 -0.0144551 -0.0031863 -0.3056195 -0.8049414 0.8479684 -0.2181412 0.9512884 -1.2419751 0.1326729 0.1499861 -0.2693064 -0.4209486 -0.437375 -0.7930175 0.094464 -0.7482822 -1.7551289 0.1753675 -0.1438934 -0.3860759 -0.453039 -0.4839452 0.1599916 -0.0072759 -0.0483002 -1.5558932 0.0892988 -0.023966 -0.0227071 -0.2183116 -1.0931191 -0.5255135 0.0174428 -0.3032259 -0.9419642 0.0392779 -0.0174703 -0.0595693 -0.202512 0.2804961 -0.1731087 -0.0127604 -0.1700037 0.1474319 0.0284605 -0.0209953 0.0531478 0.2208433 0.1109177 -0.1522785 0.0635505 -0.2041941 0.4555799 0.0041864 0.0063042 0.0252739 0.2467405 0.2287413 0.2626425 0.0153195 0.2024341 0.2668479 0.0024682 0.0247049 0.0471399 0.2449243 0.0212803 0.05065 -0.015318 0.0845561 0.4966161 0.0128725 0.0210763 0.0526385 0.2487816 1.246779 -0.7298258 0.0719705 -0.7064509 1.398936 -0.065463 -0.1459189 0.2360824 0.1246072 0.9483764 0.6512652 -0.0263165 0.6680835 2.1625994 -0.0557425 0.1282662 0.387203 0.1237755 -0.7105162 0.8679182 -0.0043833 0.8008512 0.3434193 0.1029019 0.0499795 0.0672296 -0.1279066 1.8692955 -0.3852894 0.0046825 -0.1408759 0.7981113 -0.0225383 0.0156906 0.0329581 0.2129047 0.6531258 -0.1918936 -0.0044316 -0.4100531 0.4310885 -0.0013418 -0.0135957 0.0017857 0.2676823 -0.0960697 0.0705977 0.0485023 0.0030495 0.0996442 -0.0420354 0.0985575 -0.0530298 0.0425105 0.0170896 0.0089261 -0.0061175 -0.0418671 0.0350914 -0.1130419 -0.0814094 -0.0324312 0.0126754 0.0389163 0.0206412 0.0956245 0.0241848 0.0187094 -0.0257677 0.0166397 0.0824674 -0.0655145 0.1207519 -0.0641953 0.0236058 0.0218908 -0.1171744 -0.0131779 0.0130278 -0.056407 0.0508896 -0.089751 -0.1259783 -0.0290302 -0.0425263 0.0835475 -0.0413433 -0.0746814 -0.0646997 0.0426738 0.0202378 -0.0230973 0.0318467 0.0104862 0.0340322 -0.1097496 0.0963455 0.0078744 -0.0276259 0.0379693 0.0135234 -0.108199 -0.013107 0.011751 -0.0427867 -0.0593745 0.0897836 -0.0416999 0.0981882 0.1105065 -0.0157673 0.0302497 -0.1141865 -0.0425886 -0.0033327 -0.0908248 0.044301 -0.1554275 -0.0083566 -0.000288 -0.0821408 0.0684358 -0.0005022 -0.0021167 -0.0005086 0.1225986 0.0615616 -0.0152798 -0.063241 0.1140634 -0.0136801 -0.0736462 -0.0108412 -0.0869025 -0.061277 0.0582601 -0.0189334 0.0622557 0.1168067 -0.030546 0.0835815 0.0176237 0.0942769 -0.0588685 unknown
polarizability: 171.9036123|0.2865955|197.8885675|2.2902733|-5.3873133|75.2403231 unknown
InChI: InChI=1S/C9H11ClN4O/c1-15-8-6(10)7(13-2-3-13)11-9(12-8)14-4-5-14/h2-5H2,1H3
charge 0 multiplicity 1
26 atoms
Cl 1.475963 2.805588 0.176409
O  2.803357 0.095255 0.05731
N  -1.578314 2.175497 0.202354
N  -1.124367 -2.498434 -0.248459
N  -1.34672 -0.16619 -0.022012
N  0.849464 -1.230777 -0.029896
C  -2.886992 2.327488 -0.473576
C  -1.735239 3.299825 -0.763742
C  -2.263155 -3.024444 0.53455
C  -0.883327 -3.705592 0.573655
C  -0.745255 1.066341 0.053824
C  -0.521726 -1.251921 -0.069483
C  0.670344 1.189669 0.06669
C  1.430644 -0.004517 0.02859
C  3.56499 -1.172322 0.0114
H  -3.71276 2.646717 0.169656
H  -3.143367 1.582459 -1.235161
H  -1.230688 3.211124 -1.733245
H  -1.739257 4.302421 -0.326888
H  -3.074963 -3.472612 -0.046445
H  -2.577501 -2.448778 1.413284
H  -0.279616 -3.585148 1.481269
H  -0.717426 -4.635065 0.020559
H  4.616577 -0.851603 0.016779
H  3.321877 -1.737628 -0.903513
H  3.332857 -1.794657 0.89179
