program: Gaussian 09
title: 000202896
version: EM64L-G09RevD.01
frameworkgroup: C1[X(C22H27Cl3O2)]
method: RPBEPBE
basis: SDD
operation: Freq
keyword: #p
keyword: freq=noraman
keyword: PBEPBE/SDD
title: #p freq=noraman PBEPBE/SDD
converged: YES YES NO NO
title: Mulliken charges:
elementType: Cl Cl Cl O O C C C C C C C C C C C C C C C C C C C C C C H H H H H H H H H H H H H H H H H H H H H H H H H H H
charge: 0.073666 0.104560 0.091235 -0.415670 -0.414505 -0.297430 0.409256 0.448841 0.368184 0.399840 0.335008 0.293768 -0.547867 -0.556221 -0.696307 -0.223186 -0.224912 0.048279 0.047763 -0.594744 -0.580040 -0.880997 -0.875607 -0.671951 -0.724006 -0.726894 -0.673894 0.273668 0.256128 0.265644 0.176933 0.183286 0.254247 0.254162 0.243372 0.223340 0.252282 0.243728 0.248732 0.240291 0.230895 0.214064 0.220979 0.225397 0.221289 0.218723 0.210267 0.220967 0.234373 0.220197 0.214617 0.230116 0.351576 0.354558
chargesum: 0.00000
title: Mulliken charges with hydrogens summed into heavy atoms:
elementType: Cl Cl Cl O O C C C C C C C C C C C C C C C C C C C C C C
charge: 0.073666 0.104560 0.091235 -0.064094 -0.059947 -0.023762 0.409256 0.448841 0.368184 0.399840 0.335008 0.293768 -0.291739 -0.290576 -0.696307 -0.046253 -0.041626 0.048279 0.047763 -0.340498 -0.325878 -0.162003 -0.142856 -0.006012 -0.058597 -0.061287 -0.008964
polarizability: 3.28561944e+02 -1.13954126e+01 2.71123823e+02 1.21879156e+01 -2.65281349e+01 2.43148509e+02
1716.lowfreq: -9.3062 -7.7077 0.0015 0.0023 0.0024 3.7777 11.8319 23.9134 31.0560
frequency: 9.4747 23.5886 31.0398 37.7282 41.1681 50.5469 52.7383 70.8586 81.6318 90.0798 123.2306 124.2879 154.8697 160.3657 170.1384 186.5668 201.0429 203.5541 212.9636 220.1502 226.9576 232.4790 244.4884 250.8173 264.3354 269.6278 272.7371 278.0257 280.5613 284.2470 302.1824 311.0179 324.7886 328.7013 335.7542 351.5274 352.7451 404.5347 411.4081 420.8159 439.9277 461.3952 466.1869 497.5948 503.5344 520.1784 530.6688 557.6682 574.5223 598.0379 620.8313 640.0283 659.8995 690.0802 705.2772 713.2135 732.9544 739.6291 745.2701 755.6110 848.8976 859.3056 875.8115 880.0984 883.6052 887.2544 905.9360 914.0053 918.2727 924.9998 960.2442 961.5258 985.8642 1005.1484 1007.6546 1029.1894 1034.7119 1045.5909 1051.0265 1086.6275 1089.7279 1112.5545 1115.0494 1126.2626 1127.2747 1157.2181 1158.0332 1171.2194 1174.6541 1210.8724 1218.0774 1238.7672 1276.4355 1280.0669 1285.1484 1291.4013 1292.4387 1299.4605 1318.4165 1334.0847 1337.8648 1378.1876 1379.3626 1383.7352 1385.2328 1396.4076 1397.3149 1398.3579 1403.0990 1419.2976 1423.4363 1464.7234 1465.1033 1469.7551 1471.0586 1471.6489 1476.6864 1481.6400 1482.4918 1483.8696 1489.7893 1490.3083 1492.4296 1498.3357 1501.6746 1567.1679 1573.0508 1637.0557 1639.0205 2893.8193 2894.7128 2969.0325 2974.3579 2975.9265 2979.0576 2980.5613 2989.4865 3015.8587 3047.9301 3069.7246 3069.7847 3069.9696 3071.4539 3075.3175 3078.8792 3080.0310 3080.8501 3084.9880 3087.0154 3089.1940 3152.7718 3152.8760 3171.5356 3177.3236 3574.7993 3577.1552
redmass: 3.6535 3.2069 3.6082 2.4124 2.0105 3.8493 5.9833 4.0558 3.3955 5.3600 3.8193 3.4633 5.9427 5.5223 7.5750 7.9747 4.5441 2.7250 1.9239 1.3710 2.0138 1.3694 1.6668 2.0668 3.0581 1.8289 1.2686 8.1292 2.6086 2.6050 3.2113 2.7363 1.4300 1.3465 2.8348 3.8247 6.8394 3.2508 3.2874 3.1469 3.5014 3.4803 3.1913 3.9580 3.7335 4.2718 4.1181 4.2081 3.6602 5.5046 5.4699 5.8687 4.1575 4.8937 5.9806 6.3289 5.4891 5.2708 3.3178 3.3554 3.6395 3.5274 1.4504 1.4524 2.5491 2.7116 1.3933 1.2112 1.2619 1.4180 1.4473 1.4391 4.8422 1.5361 1.5524 2.8190 2.5609 1.6730 1.5278 1.8258 1.8879 2.6478 2.5592 2.1016 1.9625 1.5710 1.5462 2.0183 2.0859 1.8268 1.9741 1.6947 1.4789 1.4732 1.7896 1.6359 2.1241 2.0635 1.4537 1.6956 1.5944 1.2016 1.1959 3.2786 3.0956 1.2350 1.2355 1.2482 1.2369 3.5214 3.3433 1.0471 1.0495 1.0689 1.0772 1.0946 1.0566 1.0908 1.1138 1.1095 1.1093 1.0868 1.0646 2.6246 2.5130 6.2423 6.4373 6.7762 6.7189 1.0819 1.0820 1.0392 1.0351 1.0349 1.0359 1.0355 1.0370 1.0801 1.0963 1.0982 1.0982 1.0992 1.1001 1.1000 1.0999 1.0997 1.0994 1.1003 1.0975 1.0986 1.0915 1.0916 1.0893 1.0892 1.0652 1.0653
irintensity: 0.0828 0.0569 0.0158 0.1999 0.1404 0.2132 0.3887 0.1628 0.1823 0.8854 0.1210 0.5115 0.2597 0.3644 0.1707 0.3632 0.4340 0.3733 3.7044 0.9565 7.0512 0.5756 1.5139 1.1253 1.1989 1.4293 0.2327 0.5106 8.1310 1.1121 10.7693 13.9869 80.6122 102.1481 3.5274 0.8251 1.3743 3.2408 0.9606 4.3874 1.4359 2.7494 8.5854 6.6302 4.5232 45.2859 35.1887 20.3503 3.3745 54.7721 13.2239 36.3477 32.8933 28.7079 40.2708 48.5175 0.4943 0.9584 1.6207 15.3766 22.1416 32.5857 11.3791 9.6968 17.0384 21.2720 2.8509 0.3280 5.8345 31.1869 1.5499 1.4399 45.9983 42.5522 23.6568 6.5706 7.0112 11.7191 10.8400 12.5861 15.9377 23.2674 15.9319 14.5145 39.4089 87.0663 146.4230 28.5400 22.6732 53.2735 44.7906 20.1977 7.4094 11.2273 18.3462 1.9711 5.2191 12.0122 1.3855 14.9554 25.7046 11.2395 18.8157 3.8102 18.3306 28.7740 3.8514 24.6807 1.6274 1.4973 6.0315 6.3329 5.1199 16.6163 18.8877 5.4272 14.0816 27.9630 6.4907 13.9543 31.0599 30.8653 15.6651 81.3380 79.0785 54.7543 33.8637 24.2651 11.7391 40.4975 43.2966 28.5173 38.2139 34.3214 22.0722 18.9673 33.6896 7.2886 12.2506 16.1898 25.4596 23.2685 29.2167 6.6651 59.8790 45.0727 63.6408 36.6213 24.6660 15.2480 8.9313 8.5882 1.8946 0.6489 33.9610 37.3082
temp: 298.150 k
press: 1.00000 atm
elementType: 17 17 17 8 8 6 6 6 6 6 6 6 6 6 6 6 6 6 6 6 6 6 6 6 6 6 6 1 1 1 1 1 1 1 1 1 1 1 1 1 1 1 1 1 1 1 1 1 1 1 1 1 1 1
symmnumber: 1
zpe: 1134847.8 jmol-1
zpe.correction: 0.432241 hartree
zpe.thermalcorrener: 0.462498 hartree
zpe.thermalcorrenthalpy: 0.463443 hartree
zpe.thermalcorrgfe: 0.369580 hartree
zpe.sumelectzpe: -2383.140851 hartree
zpe.sumelectthermal: -2383.110593 hartree
zpe.sumelectthermalent: -2383.109649 hartree
zpe.sumelectthermalfe: -2383.203511 hartree
dipole: -0.7793 3.2882 -0.2994
dipole: 3.3925
quadrupole: -181.9304 -172.0005 -186.4983
quadrupole: -1.5709 6.0795 -13.4626
quadrupole: -1.7874 8.1426 -6.3553 -1.5709 6.0795 -13.4626
hfenergy: -2383.5730912 hartree
pointgroup: C01 [X(C22H27Cl3O2)]
dipole: -0.14706 -1.2661318 -0.3959304 debye
polarizability: 321.0730147|20.2220289|291.8229693|-13.786446|-10.6869961|229.938292 unknown
InChI: InChI=1S/C22H27Cl3O2/c1-11(2)15-9-17(13(5)7-19(15)26)21(22(23,24)25)18-10-16(12(3)4)20(27)8-14(18)6/h7-12,21,26-27H,1-6H3
charge 0 multiplicity 1
54 atoms
Cl 0.476794 -0.13811 2.974667
Cl -1.63487 2.03431 2.785434
Cl 1.294452 2.721891 2.716994
O  -4.459901 -1.275394 -1.963925
O  4.965294 -0.424426 -1.74802
C  -0.00122 1.422409 0.554933
C  -1.211482 0.683474 -0.058661
C  1.337284 0.957755 -0.056572
C  -2.870237 -1.173688 -0.051214
C  2.790349 -0.968566 -0.668279
C  -1.73911 1.155922 -1.302157
C  2.297254 1.877324 -0.587216
C  -1.789621 -0.468969 0.525126
C  1.602166 -0.432378 -0.132258
C  0.024207 1.472178 2.113904
C  -3.52664 -2.37874 0.632041
C  3.099754 -2.469935 -0.675237
C  -3.377175 -0.68012 -1.28423
C  3.736744 -0.034734 -1.178956
C  -2.815449 0.459191 -1.892989
C  3.484153 1.350484 -1.147245
C  -1.175697 2.366851 -2.02492
C  2.110528 3.387247 -0.602591
C  -4.824791 -1.938402 1.372355
C  -2.589166 -3.142418 1.595539
C  1.846134 -3.368632 -0.578872
C  4.102375 -2.819347 0.465787
H  -0.124065 2.493759 0.304449
H  -1.397952 -0.831693 1.477118
H  0.839004 -1.12242 0.234522
H  -3.817923 -3.113987 -0.155268
H  3.586027 -2.724203 -1.64687
H  -3.238787 0.795998 -2.844547
H  4.239916 2.018899 -1.571644
H  -1.741643 2.567623 -2.949509
H  -1.225591 3.283018 -1.404584
H  -0.11756 2.210968 -2.306114
H  1.174033 3.690342 -1.105838
H  2.08318 3.806765 0.418015
H  2.942711 3.869069 -1.142404
H  -4.570733 -1.245027 2.194381
H  -5.347598 -2.811403 1.805827
H  -5.5268 -1.410925 0.700288
H  -1.64926 -3.440106 1.095633
H  -3.088679 -4.056205 1.965335
H  -2.331094 -2.529018 2.478104
H  1.352855 -3.262374 0.405385
H  2.131897 -4.430194 -0.69129
H  1.10777 -3.122267 -1.362592
H  5.020665 -2.204924 0.419325
H  4.395033 -3.884908 0.4208
H  3.631979 -2.631798 1.447961
H  -4.753959 -2.097881 -1.499193
H  5.038048 -1.410283 -1.78753
