program: Gaussian 09
title: 000202713
version: EM64L-G09RevD.01
frameworkgroup: C1[X(C8H8Cl2N4)]
method: RPBEPBE
basis: SDD
operation: Freq
keyword: #p
keyword: freq=noraman
keyword: PBEPBE/SDD
title: #p freq=noraman PBEPBE/SDD
converged: NO NO NO NO
title: Mulliken charges:
elementType: Cl Cl N N N N C C C C C C C C H H H H H H H H
charge: -0.000341 0.003744 -0.127639 -0.073238 -0.039264 0.036531 -0.398702 -0.416920 -0.401717 -0.398069 0.281361 -0.109176 -0.189191 -0.164695 0.245952 0.259951 0.248321 0.253105 0.245196 0.247258 0.250935 0.246599
chargesum: 0.00000
title: Mulliken charges with hydrogens summed into heavy atoms:
elementType: Cl Cl N N N N C C C C C C C C
charge: -0.000341 0.003744 -0.127639 -0.073238 -0.039264 0.036531 0.107201 0.084505 0.090736 0.099465 0.281361 -0.109176 -0.189191 -0.164695
polarizability: 1.96366353e+02 -3.54104151e-01 1.64669013e+02 -4.57456441e+00 3.04102754e+00 6.68973730e+01
1716.lowfreq: -11.5772 -6.6744 0.0027 0.0032 0.0036 2.8026 50.7971 67.7762 83.2713
frequency: 50.7940 67.7711 83.2511 94.9086 140.7550 150.1122 169.9249 185.8020 205.3995 256.5477 294.3592 317.7022 339.8468 364.1849 422.3472 463.8571 567.9648 591.9483 636.1231 680.9617 745.0973 756.5458 771.9479 792.1057 796.7506 895.6102 912.9802 929.1362 945.3324 998.7638 1000.8097 1023.0040 1092.8666 1096.0609 1104.5162 1105.9230 1119.5392 1121.6472 1135.7135 1140.5751 1200.5625 1229.9431 1264.2865 1298.3150 1418.0795 1461.4417 1462.9076 1464.0498 1477.6920 1482.4595 1518.3089 1525.5455 3080.8953 3084.4973 3088.6743 3091.7780 3185.7910 3190.5593 3201.6259 3206.4394
redmass: 9.7508 3.3686 3.1362 4.5189 2.6570 4.5956 3.9177 22.6690 7.3819 5.4139 5.9881 10.1112 10.1420 8.3114 4.8777 7.7746 9.3542 11.4785 7.2606 10.1666 8.1480 9.1299 5.6939 1.0983 1.0463 5.3134 5.7025 5.9646 4.9628 1.0785 1.2551 2.7910 1.2821 1.2990 1.3314 1.3303 1.4505 1.6168 1.4558 1.4589 4.2451 5.7648 10.1919 9.4160 7.6864 1.0769 1.5066 1.7023 1.3225 1.5323 7.8541 10.5481 1.0485 1.0484 1.0604 1.0605 1.1190 1.1191 1.1177 1.1178
irintensity: 0.8869 3.0511 10.6223 3.3691 0.5783 1.0795 4.8976 0.0354 7.3938 27.0545 3.1296 3.6392 8.6164 6.3740 0.2439 1.2748 22.6313 4.1968 3.0585 4.1804 29.0102 24.6309 24.7018 32.1271 26.8215 14.4654 46.1173 20.8337 61.7352 0.5946 1.8316 6.6343 1.3638 4.8193 3.6502 6.4606 18.7860 62.8432 0.1117 0.9011 11.5821 29.4441 148.2508 6.2063 254.3339 4.5368 117.0280 228.2405 156.7959 194.3739 452.8399 628.6080 15.3516 12.6305 49.9825 32.5901 1.1652 0.9168 27.0464 21.0150
temp: 298.150 k
press: 1.00000 atm
elementType: 17 17 7 7 7 7 6 6 6 6 6 6 6 6 1 1 1 1 1 1 1 1
symmnumber: 1
zpe: 403759.6 jmol-1
zpe.correction: 0.153784 hartree
zpe.thermalcorrener: 0.167004 hartree
zpe.thermalcorrenthalpy: 0.167949 hartree
zpe.thermalcorrgfe: 0.112696 hartree
zpe.sumelectzpe: -1447.646055 hartree
zpe.sumelectthermal: -1447.632834 hartree
zpe.sumelectthermalent: -1447.631890 hartree
zpe.sumelectthermalfe: -1447.687143 hartree
dipole: -1.0657 -4.0859 -0.1465
dipole: 4.2251
quadrupole: -79.8169 -92.6142 -95.3059
quadrupole: -3.8599 5.8912 -2.0912
quadrupole: 9.4288 -3.3685 -6.0603 -3.8599 5.8912 -2.0912
hfenergy: -1447.7998384 hartree
pointgroup: C01 [X(C8H8Cl2N4)]
dipole: 0.7144268 -1.5006344 -0.0301284 debye
dipolederiv: -0.8091854 0.0039141 0.0250506 -0.0142987 -0.0486294 0.0005024 0.0512358 0.0006507 -0.0066921 -0.2810759 0.3430911 0.004984 0.3860352 -0.7795064 -0.0242388 0.0145596 -0.0185206 -0.0694799 -0.4859239 -0.7730094 -0.0285588 -0.7090506 -1.6023972 -0.2730816 0.1957129 0.2297383 -0.4167788 -2.2194415 -0.124184 -0.215707 0.0092147 -0.0821398 -0.0188681 0.4226357 0.02307 -0.4508215 -1.2811454 -0.4381516 -0.0892701 -0.5198065 -0.6902644 -0.0559423 0.0268161 -0.0108274 -0.2162252 -1.5908651 0.1516928 -0.0382489 0.490301 -0.6203994 -0.0034735 0.0531682 0.000602 -0.1728847 0.0416366 0.0593631 -0.022233 0.0614387 0.3849873 -0.0185148 -0.0444348 -0.025623 0.2256926 0.2637253 0.2792017 -0.0259226 0.2294765 0.3313301 0.0652168 -0.0263324 0.0005196 0.2515176 0.4905602 -0.0946433 0.0044062 -0.1636379 0.0471185 0.0167725 -0.0474509 -0.0002143 0.2537157 0.4770409 0.1355886 -0.0018935 0.1666518 0.075648 -0.0097727 -0.0440525 0.0086935 0.2547577 0.8103773 0.496526 0.0278501 0.5760118 1.7763758 0.1077459 -0.1518692 -0.2215042 0.138376 2.5853001 0.1584126 0.075357 -0.0552552 0.5965129 0.0136967 -0.405075 -0.0456177 0.1440505 0.7373971 0.121293 -0.0723203 -0.1498429 -1.101854 -0.0606536 -0.0695444 -0.0034502 -0.0777809 1.1628018 -0.3007193 -0.0048 -0.2643702 1.5421151 0.0360497 -0.0525166 0.0129514 0.0627639 0.0961647 0.0841117 0.0173661 0.0180275 -0.0735302 0.059589 0.0061365 0.1053115 0.042238 0.0194639 0.0386863 0.1015244 -0.0125829 0.0315605 0.0420935 0.0573712 -0.0602708 0.0173646 0.042933 -0.0251944 -0.0164299 -0.025443 0.0156818 0.09274 -0.080242 -0.022938 -0.0609208 -0.0797768 -0.1159863 0.0019739 -0.0282942 0.1002901 0.0256169 0.0446037 0.0327042 0.0514288 -0.0083501 0.0767611 0.0443792 0.1650006 0.016799 -0.0049797 0.0811363 -0.0353633 0.0440945 0.0116504 -0.0042504 0.0818922 0.0205722 0.0365295 0.0752923 -0.0629772 0.080074 -0.0345501 0.0197485 0.006196 0.0820916 -0.0228984 0.034568 -0.0727181 -0.0541919 -0.0886763 -0.0234135 -0.0030359 -0.0786993 0.0485089 -0.1572495 0.0092041 0.0069274 0.0853108 0.0386907 0.0435475 unknown
polarizability: 195.0684079|6.1372467|165.8081866|4.5113797|5.2385556|67.0561442 unknown
InChI: InChI=1S/C8H8Cl2N4/c9-5-6(10)11-8(14-3-4-14)12-7(5)13-1-2-13/h1-4H2
charge 0 multiplicity 1
22 atoms
Cl -3.168488 0.298925 0.156078
Cl -1.430651 3.105178 0.10062
N  -1.283337 -2.153234 0.175461
N  2.738312 0.277912 -0.206809
N  0.728762 -0.938219 -0.020055
N  0.737242 1.500311 0.003056
C  -0.857326 -3.412138 -0.475403
C  -2.229253 -2.791995 -0.781809
C  3.732609 -0.465055 0.597318
C  3.716269 1.075525 0.56173
C  -0.637287 -0.930415 0.041549
C  1.35988 0.274603 -0.044953
C  -1.366344 0.305095 0.062892
C  -0.602719 1.48555 0.047828
H  -0.796926 -4.283507 0.183381
H  -0.071342 -3.33718 -1.23515
H  -2.360504 -2.314658 -1.759799
H  -3.133732 -3.217753 -0.338827
H  4.490275 -1.013576 0.030045
H  3.373193 -0.960887 1.50671
H  3.345658 1.606386 1.446296
H  4.462107 1.613233 -0.030861
