program: Gaussian 09
title: 000202718
version: EM64L-G09RevD.01
frameworkgroup: C1[X(C20H23N)]
method: RPBEPBE
basis: SDD
operation: Freq
keyword: #pfreq=noraman
keyword: PBEPBE/SDD
title: #p freq=noraman PBEPBE/SDD
converged: YES YES NO NO
title: Mulliken charges:
elementType: N C C C C C C C C C C C C C C C C C C C C H H H H H H H H H H H H H H H H H H H H H H H
charge: -0.066404 -0.349579 -0.361256 -0.402329 -0.389909 -0.400150 -0.444711 -0.365949 0.260571 0.293311 0.254996 -0.388183 -0.397163 -0.412571 -0.420135 -0.230903 -0.227740 -0.234292 -0.237074 -0.248904 -0.245931 0.160281 0.229244 0.209364 0.165160 0.190241 0.206002 0.204123 0.190674 0.213781 0.188197 0.232607 0.212694 0.248478 0.252271 0.252340 0.242330 0.258254 0.224702 0.226513 0.224169 0.226360 0.228111 0.228410
chargesum: 0.00000
title: Mulliken charges with hydrogens summed into heavy atoms:
elementType: N C C C C C C C C C C C C C C C C C C C C
charge: -0.066404 0.039946 0.013268 -0.006086 0.004887 0.001828 0.000590 -0.117471 0.260571 0.293311 0.254996 -0.135912 -0.144824 -0.170241 -0.161881 -0.006200 -0.001228 -0.010123 -0.010714 -0.020793 -0.017521
polarizability: 2.71500572e+02 -9.96257802e+00 2.41194979e+02 7.07497866e+00 1.47470858e+01 1.63301137e+02
1716.lowfreq: -13.6679 -8.5820 -0.0006 0.0005 0.0006 6.0884 30.1487 32.1050 34.5870
frequency: 29.9894 31.8200 34.4332 48.0963 59.8790 67.9586 102.9725 129.1835 178.8161 212.6320 217.2638 241.6499 264.3142 272.8411 299.1231 311.0671 378.4359 405.4358 407.3002 426.9165 432.6503 452.7790 462.2091 477.0850 548.7791 589.6851 610.1804 615.1699 632.7181 644.8792 701.9817 706.6148 714.4583 749.6063 776.1326 779.1026 805.2816 846.3521 851.6230 854.5652 858.4466 869.7530 887.5919 899.5392 925.0318 929.4851 959.8426 976.4365 978.2689 981.7516 988.2656 989.7443 993.6358 994.4427 995.6978 1025.4913 1029.3114 1045.8487 1078.4036 1080.4240 1082.2764 1098.8327 1104.2560 1121.2827 1149.8179 1151.8353 1166.4639 1171.6621 1172.0563 1184.5371 1190.1616 1194.0312 1240.3386 1259.6896 1263.7818 1276.4413 1290.9362 1311.7776 1318.6980 1324.7434 1331.3846 1338.1035 1346.9487 1351.8650 1359.2199 1370.4342 1376.7783 1388.1751 1431.1112 1434.0647 1450.5895 1457.7086 1458.9084 1467.5228 1469.8310 1477.3986 1480.1950 1485.0255 1579.7007 1581.0887 1606.1920 1609.4972 1632.9594 2802.2334 2822.9835 2898.1534 2965.1686 2965.6596 2983.7958 2985.1986 3015.6456 3023.9755 3033.5846 3044.6960 3053.9761 3102.7752 3121.1796 3121.8643 3128.0979 3128.7853 3141.4800 3141.8892 3149.1642 3149.8357 3163.6714 3164.0420
redmass: 3.9419 3.2972 4.1129 3.6526 3.7955 4.6797 3.8243 4.1894 2.8211 3.5889 3.4874 2.2617 3.8400 3.2423 2.2881 4.2415 1.7238 2.8417 2.8675 3.2404 3.3845 3.0690 3.5282 3.1923 1.8878 3.8112 5.7954 6.3763 4.4210 4.1894 1.7751 1.8613 3.3438 2.7956 2.0060 2.2198 1.4689 2.2517 1.2640 1.4832 1.2705 1.6133 2.5672 2.3236 1.4799 1.5374 1.2895 1.4378 1.6098 1.7898 4.9595 4.9963 1.7990 1.3585 1.6294 2.4015 2.0912 2.1398 1.4389 1.7557 1.6151 2.4582 2.5007 2.5195 1.3312 2.3277 2.3953 1.0582 1.0613 1.2747 1.1209 1.1339 1.6966 1.3744 1.2140 1.5937 1.4770 1.4180 1.3487 1.3698 1.3810 1.4223 1.5336 1.6017 1.4771 6.0486 4.6344 1.5773 2.2481 2.2857 1.0910 1.0874 1.0877 1.0934 1.0836 2.0286 1.1555 2.3363 5.7887 5.9064 6.0117 6.0494 8.1649 1.0708 1.0700 1.0637 1.0922 1.0629 1.0616 1.0616 1.0866 1.0882 1.0952 1.1034 1.1036 1.0884 1.0843 1.0843 1.0874 1.0875 1.0921 1.0921 1.0961 1.0962 1.1015 1.1015
irintensity: 0.0765 0.1844 0.1599 0.1688 0.0340 0.2658 0.8775 0.3389 2.1550 0.2662 0.1694 0.9296 0.9939 1.2641 3.1388 0.3891 3.5049 0.1286 0.0409 1.0017 2.3079 1.1002 1.6774 1.8880 3.1832 12.0010 1.4998 0.1268 11.7184 7.7518 47.3819 51.1026 6.9505 19.2125 54.8230 27.0795 0.2854 4.5689 0.9211 9.5958 0.2242 6.1285 1.5577 10.0133 1.7915 4.3550 3.2334 0.9188 21.3987 19.9537 3.5688 2.9725 5.8992 1.3825 1.3404 3.7736 10.5439 6.1629 7.1691 7.8841 3.3888 4.2542 46.9360 3.0398 4.8023 26.3274 3.1755 0.0947 0.0521 1.3599 0.2577 0.8913 8.5553 6.0961 3.3132 13.6026 8.3219 2.9621 1.4770 23.6783 3.2819 0.2749 2.8691 10.4106 6.5989 2.6411 2.6974 5.9893 5.2940 9.9137 7.5027 10.1546 14.1804 10.1116 3.2695 11.1772 11.0054 13.5839 1.7807 1.0474 7.7050 3.2270 0.6689 62.4288 125.0006 81.8929 22.1047 42.2098 34.6187 32.2784 70.2259 51.5180 52.0487 22.0239 87.9730 18.2400 2.8559 1.6247 1.6524 1.4396 24.7723 15.5467 38.6945 35.1013 31.1094 15.6778
temp: 298.150 k
press: 1.00000 atm
elementType: 7 6 6 6 6 6 6 6 6 6 6 6 6 6 6 6 6 6 6 6 6 1 1 1 1 1 1 1 1 1 1 1 1 1 1 1 1 1 1 1 1 1 1 1
symmnumber: 1
zpe: 984081.4 jmol-1
zpe.correction: 0.374817 hartree
zpe.thermalcorrener: 0.393436 hartree
zpe.thermalcorrenthalpy: 0.394380 hartree
zpe.thermalcorrgfe: 0.326024 hartree
zpe.sumelectzpe: -829.130416 hartree
zpe.sumelectthermal: -829.111797 hartree
zpe.sumelectthermalent: -829.110853 hartree
zpe.sumelectthermalfe: -829.179209 hartree
dipole: -0.3372 0.8154 -0.0102
dipole: 0.8824
quadrupole: -117.2185 -118.6875 -123.7348
quadrupole: -2.3014 -0.2909 3.3172
quadrupole: 2.6617 1.1927 -3.8545 -2.3014 -0.2909 3.3172
hfenergy: -829.5052332 hartree
pointgroup: C01 [X(C20H23N1)]
dipole: -0.1654825 0.2994084 0.0591049 debye
polarizability: 273.3447475|-7.1691409|230.2844795|2.9432543|29.2357383|172.3674612 unknown
InChI: InChI=1S/C20H23N/c1-4-10-18(11-5-1)20(19-12-6-2-7-13-19)14-17-21-15-8-3-9-16-21/h1-2,4-7,10-14H,3,8-9,15-17H2
charge 0 multiplicity 1
44 atoms
N  -2.771405 -0.744953 -0.635589
C  -2.846506 -0.794581 0.845801
C  -4.053473 -0.292966 -1.232547
C  -3.966249 -1.74686 1.311775
C  -5.210783 -1.231159 -0.833671
C  -5.326483 -1.332182 0.704608
C  -1.617563 0.058797 -1.1225
C  -0.295159 -0.600387 -0.800172
C  0.853396 -0.017826 -0.327452
C  2.119886 -0.817025 -0.249668
C  0.915848 1.413124 0.126686
C  3.077379 -0.5675 0.773752
C  1.889497 2.297132 -0.413534
C  2.400556 -1.850072 -1.189064
C  0.03272 1.912397 1.122319
C  4.254467 -1.340106 0.872127
C  1.959997 3.643334 0.006722
C  3.576815 -2.622641 -1.091638
C  0.107222 3.256158 1.550759
C  4.509887 -2.374871 -0.057591
C  1.067396 4.130239 0.990483
H  -3.037603 0.229057 1.27172
H  -1.867131 -1.13464 1.23067
H  -3.938339 -0.279134 -2.333241
H  -4.304728 0.753997 -0.911211
H  -4.014638 -1.744366 2.417937
H  -3.714776 -2.775499 0.988629
H  -5.014403 -2.235836 -1.255673
H  -6.155774 -0.858906 -1.27441
H  -6.115411 -2.054321 0.988266
H  -5.627166 -0.345746 1.115779
H  -1.646634 1.112879 -0.758519
H  -1.709247 0.105342 -2.229145
H  -0.278356 -1.673628 -1.038513
H  2.888124 0.229892 1.500696
H  2.589508 1.923197 -1.169331
H  1.704171 -2.027109 -2.016317
H  -0.698217 1.23457 1.576924
H  4.971865 -1.135759 1.675111
H  2.711654 4.310441 -0.430399
H  3.773635 -3.408259 -1.830165
H  -0.578365 3.617975 2.325559
H  5.426301 -2.971157 0.015513
H  1.124979 5.17336 1.321214
