program: Gaussian 09
title: 000202704
version: EM64L-G09RevD.01
frameworkgroup: C1[X(C12H9Cl2O2P)]
method: RPBEPBE
basis: SDD
operation: Freq
keyword: #p
keyword: freq=noraman
keyword: PBEPBE/SDD
title: #p freq=noraman PBEPBE/SDD
converged: YES YES NO NO
title: Mulliken charges:
elementType: Cl Cl P O O C C C C C C C C C C C C H H H H H H H H H
charge: -0.040800 -0.038773 1.112389 -0.676061 -0.615931 -0.152391 -0.180976 -0.216407 -0.220429 -0.270874 -0.269357 -0.202090 -0.198102 -0.190580 -0.190755 -0.096149 -0.097700 0.273161 0.255908 0.279798 0.291916 0.263153 0.263799 0.264643 0.264975 0.387633
chargesum: 0.00000
title: Mulliken charges with hydrogens summed into heavy atoms:
elementType: Cl Cl P O O C C C C C C C C C C C C
charge: -0.040800 -0.038773 1.112389 -0.288428 -0.615931 -0.152391 -0.180976 0.056754 0.035479 0.008924 0.022559 0.061063 0.065697 0.074063 0.074219 -0.096149 -0.097700
polarizability: 2.41407743e+02 4.12890876e+00 1.40441955e+02 -4.74271814e+00 -1.71181101e+01 1.47858412e+02
1716.lowfreq: -4.5616 0.0012 0.0015 0.0023 6.8339 8.2129 23.2213 26.6559 41.7514
frequency: 23.0797 26.6103 41.7389 75.9204 96.8199 123.1117 137.7211 196.8522 208.1196 234.3737 251.9705 259.5738 272.2455 316.6189 326.8934 371.2018 393.9326 401.6948 402.8547 405.7311 473.1107 491.5065 518.1429 557.1047 618.5705 619.3585 667.5965 712.7282 716.7663 724.9030 730.2657 821.7770 836.9874 840.8089 846.1307 950.4485 960.9242 975.5029 982.2009 988.4454 995.4849 1000.0255 1023.5513 1067.9002 1069.7282 1091.4386 1101.3997 1106.5155 1114.1010 1183.8862 1189.2027 1289.4356 1293.7662 1362.1779 1368.2154 1386.1563 1387.8524 1460.7154 1464.4204 1578.1461 1581.9535 1582.3192 1584.9116 3145.7087 3146.9557 3147.1047 3159.8997 3173.4013 3176.1858 3176.4957 3180.1449 3596.2449
redmass: 13.0187 3.9834 4.2340 9.3398 9.7786 7.9881 8.4789 4.1868 8.5982 9.7240 2.2642 7.9940 7.7066 2.4602 4.5335 7.8995 9.5706 5.5185 3.1536 2.9535 7.5348 3.4715 3.3859 7.8131 7.2469 7.1266 11.5987 4.1376 6.0717 4.5178 6.4473 1.3772 1.3990 1.2840 1.3161 1.3500 1.3370 1.3702 1.3812 2.1804 4.1021 3.5515 2.7748 3.8845 3.6127 2.6407 2.4755 1.4054 1.4582 1.1328 1.1301 1.2394 1.2433 4.5162 4.8884 4.2116 3.9122 2.1754 2.1715 7.7576 7.1681 6.4919 6.0504 1.0902 1.0895 1.0903 1.0888 1.0957 1.0969 1.0959 1.0976 1.0661
irintensity: 0.0871 0.0449 0.1293 1.0986 2.2074 0.1004 3.6496 6.1379 13.1875 1.7287 52.4804 3.5132 2.2579 98.1303 4.4797 26.7150 93.8041 8.3293 3.3733 5.9811 3.3521 22.6497 49.9163 93.2289 9.3997 0.3900 118.3580 2.7505 28.4935 73.7463 129.3390 24.9482 37.8645 6.0779 21.4826 0.2769 0.3271 0.5639 2.2457 59.8138 59.2177 21.1913 79.9895 88.3532 51.7209 28.5755 39.6323 0.7810 3.9344 7.4645 1.2434 0.4977 4.3561 0.1056 8.5242 1.6300 26.3775 61.2348 40.1159 0.5250 21.7467 40.7930 45.7694 1.4461 1.4497 0.2393 0.2626 2.2479 2.0991 2.2578 1.7579 55.1461
temp: 298.150 k
press: 1.00000 atm
elementType: 17 17 15 8 8 6 6 6 6 6 6 6 6 6 6 6 6 1 1 1 1 1 1 1 1 1
symmnumber: 1
zpe: 465262.3 jmol-1
zpe.correction: 0.177209 hartree
zpe.thermalcorrener: 0.193520 hartree
zpe.thermalcorrenthalpy: 0.194464 hartree
zpe.thermalcorrgfe: 0.130770 hartree
zpe.sumelectzpe: -1873.262408 hartree
zpe.sumelectthermal: -1873.246097 hartree
zpe.sumelectthermalent: -1873.245153 hartree
zpe.sumelectthermalfe: -1873.308847 hartree
dipole: 1.0608 -1.3637 1.7399
dipole: 2.4520
quadrupole: -128.0326 -131.1799 -108.8019
quadrupole: 4.3521 1.2971 2.6623
quadrupole: -5.3611 -8.5084 13.8695 4.3521 1.2971 2.6623
hfenergy: -1873.4396173 hartree
pointgroup: C01[X(C12H9Cl2O2P1)]
dipole: -0.4040311 0.5464326 0.6846661 debye
dipolederiv: -0.7131694 -0.3548687 0.0506322 -0.4300847 -0.3026634 0.022146 0.0614766 0.0229864 -0.1170202 -0.7043055 0.3608842 -0.0346573 0.4293413 -0.3214529 -0.0025955 -0.0413082 -0.0011535 -0.1018844 2.5044893 -0.07462 -0.0468594 -0.0328107 1.6536132 -0.2032959 -0.0951583 -0.2499055 1.2804982 -0.7724898 0.1758258 0.043075 0.1496244 -0.7348433 0.2316725 0.051353 0.3566808 -0.9613241 -0.9265572 0.016498 0.0087737 0.0193456 -0.7352702 -0.0452072 0.0172105 -0.0348501 -0.572719 -0.3983087 -0.0130056 0.0051497 0.0289349 -0.3668451 0.0198829 -0.0791127 -0.0362855 -0.1978793 -0.4499494 0.030745 -0.0065832 -0.0220534 -0.408537 0.0327986 0.0649168 -0.0020265 -0.2366589 -0.05227 0.0300923 -0.0846734 0.1120989 -0.0183761 -0.0628149 0.1771093 0.0943184 0.029076 -0.0399288 0.0123161 0.1074226 -0.1379176 -0.0023865 -0.0061038 -0.1146549 0.1247964 0.0017489 -0.0347911 0.091449 0.0531846 0.0055111 -0.0366784 0.0916049 -0.227203 -0.072612 0.0371432 -0.0116453 -0.1106492 -0.0370528 0.0946956 -0.0395163 0.1043522 0.2255489 -0.0469804 0.002823 -0.348256 -0.1146017 0.125252 -0.1510225 -0.1499311 0.094757 0.1108581 0.0757278 -0.0352089 -0.3763508 0.1203851 -0.0838041 0.1488307 -0.1198865 0.0964012 -0.0851701 0.0766572 -0.0398195 -0.3045754 -0.1478852 -0.1002234 -0.1747979 -0.1936498 -0.0457526 -0.066486 -0.0224909 0.0006804 -0.258763 0.1730928 0.1114651 0.1862868 -0.2104207 -0.0325389 0.0792695 -0.0126775 -0.0157366 0.997612 0.6153085 -0.093903 0.6931952 0.3696887 -0.008571 -0.1169913 -0.01946 0.1773168 0.9953959 -0.6118724 0.0908486 -0.6781906 0.413182 0.0555281 0.1070001 0.0416552 0.1234259 0.1088708 -0.020083 0.0685623 -0.0106008 0.1284346 0.0088781 0.0713506 0.0018446 0.0233288 0.0609721 0.0102796 -0.0985399 0.0043018 0.112098 -0.0111722 -0.0968756 -0.024514 0.0389153 0.1158437 -0.0454991 -0.0495935 -0.0194312 0.1074471 -0.0575854 -0.0394538 -0.0309248 0.0515626 0.1433053 0.0326579 0.0295506 -0.0038626 0.0918396 -0.0647185 0.0146982 -0.0385836 0.075851 0.074844 -0.0625541 -0.0340524 -0.0751506 0.109058 -0.0563948 -0.0355241 -0.0531085 0.019748 0.085534 0.0545044 0.0049867 0.0639296 0.0700167 -0.0838807 0.006765 -0.0810787 0.045761 0.0681657 -0.0440225 0.0629268 -0.0565852 0.1359664 0.0035597 0.0674873 0.0020322 0.0077333 0.0365476 0.0273698 -0.0807717 0.0389242 0.1274202 -0.025895 -0.0849023 -0.0279577 0.0433397 0.19978 -0.1517471 -0.0111158 -0.1825124 0.3216928 -0.0550549 0.0277965 -0.0420898 0.3192991 unknown
polarizability: 241.5790195|3.6002366|140.71538|3.5984959|17.1030466|147.4137107 unknown
InChI: InChI=1S/C12H9Cl2O2P/c13-9-1-5-11(6-2-9)17(15,16)12-7-3-10(14)4-8-12/h1-8,15H
charge 0 multiplicity 1
26 atoms
Cl 5.348114 1.956861 -0.329059
Cl -5.35085 2.067021 -0.124805
P  -0.024813 -1.61382 0.081575
O  0.09618 -2.115144 1.758793
O  -0.114349 -2.751193 -1.044283
C  1.514795 -0.586365 0.017497
C  -1.544371 -0.534112 0.064352
C  2.04723 0.036778 1.169585
C  -1.826777 0.372985 1.112471
C  2.157306 -0.454992 -1.235545
C  -2.423209 -0.656653 -1.036952
C  3.221337 0.814357 1.067471
C  -2.990501 1.170736 1.059237
C  3.330756 0.322153 -1.347527
C  -3.590575 0.135442 -1.099178
C  3.837969 0.949624 -0.192568
C  -3.850867 1.039003 -0.050086
H  1.573093 -0.111341 2.144273
H  -1.156493 0.45464 1.974606
H  1.755689 -0.97315 -2.113215
H  -2.194439 -1.379725 -1.827717
H  3.650373 1.298236 1.949126
H  -3.224536 1.876111 1.861427
H  3.840172 0.431891 -2.308706
H  -4.281031 0.050921 -1.942866
H  -0.546601 -2.826066 2.009492
