program: Gaussian 09
title: 000202696
version: EM64L-G09RevD.01
frameworkgroup: C1[X(C18H10O5)]
method: RPBEPBE
basis: SDD
operation: Freq
keyword: #pfreq=noraman
keyword: PBEPBE/SDD
title: #p freq=noraman PBEPBE/SDD
converged: YES YES NO YES
title: Mulliken charges:
elementType: O O O O O C C C C C C C C C C C C C C C C C C H H H H H H H H H H
charge: -0.337842 -0.338267 -0.297359 -0.165786 -0.393158 0.263009 0.217364 0.342319 0.333885 0.012237 0.321323 -0.182487 -0.185795 -0.002666 -0.242632 0.139049 -0.426675 -0.362715 -0.359074 -0.359857 -0.189970 -0.273866 -0.273467 0.291612 0.194162 0.194544 0.260232 0.236990 0.244214 0.244187 0.356118 0.353918 0.386451
chargesum: 0.00000
title: Mulliken charges with hydrogens summed into heavy atoms:
elementType: O O O O O C C C C C C C C C C C C C C C C C C
charge: 0.018276 0.015651 -0.297359 -0.165786 -0.006707 0.263009 0.217364 0.342319 0.333885 0.012237 0.321323 -0.182487 -0.185795 -0.002666 -0.242632 0.139049 -0.135063 -0.168553 -0.164530 -0.099625 0.047020 -0.029653 -0.029280
polarizability: 4.43351705e+02 1.19675407e+01 2.41516118e+02 1.06729109e-03 1.03465606e-03 7.81948328e+01
1716.lowfreq: -8.3429 -0.0005 -0.0003 0.0004 2.8397 7.7096 16.2186 26.5672 33.4578
frequency: 15.5282 26.5416 33.4540 61.0764 109.9295 158.8703 159.3657 182.5685 227.6282 246.8110 262.4342 286.3474 286.4958 297.1327 329.9668 353.6928 374.6270 402.3052 428.5975 435.2062 440.3944 446.3595 452.1096 474.1483 500.9318 513.2327 520.3267 542.6193 545.9894 605.5360 630.3208 648.9819 656.2499 707.8177 710.9090 724.9748 752.0643 768.2023 775.4359 811.2534 813.3274 853.5690 858.9161 885.1344 912.1208 934.2517 938.3700 979.2936 984.7659 988.2468 998.7246 1021.9349 1047.5588 1060.2652 1094.9163 1116.6324 1156.4069 1160.9810 1177.2960 1198.5815 1206.2974 1255.9564 1267.3243 1275.8867 1285.3380 1301.9192 1349.4535 1362.3512 1373.9206 1412.2445 1427.5043 1431.3420 1439.5685 1450.0294 1454.3969 1500.8807 1529.4680 1540.0512 1578.9896 1589.1087 1591.1018 1619.9097 1628.4630 2641.1044 3096.7912 3100.0084 3142.8013 3152.1813 3170.0518 3173.0605 3178.9881 3538.6437 3539.5060
redmass: 5.2096 6.2522 5.9813 2.6656 8.1354 6.4938 5.3684 5.1279 3.4263 2.1099 7.2730 5.5921 1.4004 4.3554 7.2257 8.0780 7.2794 6.7575 11.0457 6.2701 4.8143 2.4180 10.2750 9.0866 8.6810 4.2427 6.9146 4.8036 7.3131 6.8509 4.3402 4.3928 5.3015 3.4379 6.9986 6.5070 1.7944 4.2394 2.1615 6.3742 1.7013 2.3613 7.9146 4.6301 6.3983 1.5482 1.3840 1.0643 1.3510 7.2564 1.3603 4.5552 2.4265 1.8849 3.6207 3.3602 1.4827 1.3551 1.3154 1.1905 1.8362 1.7287 3.7449 2.9061 2.5292 2.9424 6.8480 3.5779 4.8093 8.9077 6.6018 2.4178 2.7066 3.7880 4.5283 3.0558 7.3493 3.6983 4.2639 7.3339 6.6987 5.8380 5.9206 1.0714 1.0883 1.0889 1.0879 1.0911 1.0921 1.0995 1.0981 1.0647 1.0649
irintensity: 16.0324 0.4019 0.5309 0.0477 0.1674 0.6339 5.5356 2.4004 29.6228 81.7693 0.4687 0.4827 0.8028 17.7095 12.7158 7.8837 1.2095 0.4321 11.2000 14.9582 0.9481 83.4216 0.4009 13.2147 17.1443 0.0405 1.0661 0.2608 1.7578 7.5614 5.6071 5.4995 13.8343 13.3046 21.6536 4.0775 101.3025 16.7698 14.7641 18.2679 42.0181 7.1359 57.5293 1.5984 64.5056 0.3378 0.4171 125.4898 0.0751 9.7877 1.9990 41.9561 13.4620 10.1283 86.0383 5.9731 63.1942 119.2074 23.1430 12.9604 126.0504 51.7758 4.2189 506.5407 259.3096 126.1197 4.5423 235.6359 42.4237 46.1963 1.8729 12.2060 17.5593 246.2641 74.2617 92.5592 128.4578 10.2059 74.7530 81.3832 3.9152 3.7052 58.1641 250.3526 24.6860 1.3936 14.4530 10.9487 0.3711 22.8901 18.5238 25.2806 29.3214
temp: 298.150 k
press: 1.00000 atm
elementType: 8 8 8 8 8 6 6 6 6 6 6 6 6 6 6 6 6 6 6 6 6 6 6 1 1 1 1 1 1 1 1 1 1
symmnumber: 1
zpe: 608255.5 jmol-1
zpe.correction: 0.231672 hartree
zpe.thermalcorrener: 0.249519 hartree
zpe.thermalcorrenthalpy: 0.250463 hartree
zpe.thermalcorrgfe: 0.184332 hartree
zpe.sumelectzpe: -1066.493783 hartree
zpe.sumelectthermal: -1066.475936 hartree
zpe.sumelectthermalent: -1066.474992 hartree
zpe.sumelectthermalfe: -1066.541123 hartree
dipole: -7.6288 -0.0209 0.0019
dipole: 7.6289
quadrupole: -91.9065 -136.9990 -135.0659
quadrupole: 9.6998 -0.0018 0.0085
quadrupole: 29.4173 -15.6752 -13.7421 9.6998 -0.0018 0.0085
hfenergy: -1066.7254551 hartree
pointgroup: C01 [X(C18H10O5)]
dipole: -3.0012524 -0.0284539 0.0158106 debye
polarizability: 443.6029758|-9.4968504|241.2537146|-2.0167598|0.0354971|78.2059654 unknown
InChI: InChI=1S/C18H10O5/c19-11-7-3-6-10-12(11)18(23)14-13(17(10)22)15(20)8-4-1-2-5-9(8)16(14)21/h1-7,19-21H
charge 0 multiplicity 1
33 atoms
O  -1.201165 2.782434 0.039115
O  -1.595519 -2.838053 0.041381
O  1.343223 2.552442 0.025105
O  0.970714 -2.964076 0.028285
O  3.838095 2.422141 0.01103
C  -0.13354 0.613485 0.033471
C  -0.233131 -0.8445 0.034154
C  -2.621988 0.779249 0.047007
C  -2.721989 -0.655439 0.04764
C  2.408961 0.425066 0.019338
C  2.330058 -0.996985 0.019992
C  -1.311715 1.397691 0.03982
C  -1.510315 -1.451195 0.041019
C  1.203894 1.260274 0.02603
C  1.005249 -1.692562 0.027658
C  3.704977 1.057506 0.011938
C  3.504707 -1.776205 0.013464
C  -3.827508 1.552213 0.053551
C  -4.02351 -1.252364 0.054892
C  4.878971 0.259341 0.005372
C  4.771837 -1.142901 0.006178
C  -5.085728 0.945413 0.060515
C  -5.184901 -0.475941 0.061218
H  3.404601 -2.865015 0.014223
H  -3.799941 2.649805 0.053317
H  -4.148825 -2.343105 0.055794
H  5.848666 0.764998 -0.000218
H  5.683129 -1.750598 0.00109
H  -5.992326 1.558212 0.065448
H  -6.167926 -0.956717 0.06675
H  -2.09285 3.214723 0.044045
H  -2.539226 -3.140772 0.045848
H  2.86542 2.805233 0.016528
