program: Gaussian 09
title: 000202688
version: EM64L-G09RevD.01
frameworkgroup: C1[X(C8H9BrN2OS)]
method: RPBEPBE
basis: SDD
operation: Freq
keyword: #p
keyword: freq=noraman
keyword: PBEPBE/SDD
title: #p freq=noraman PBEPBE/SDD
converged: YES YES NO NO
title: Mulliken charges:
elementType: Br S O N N C C C C C C C C H H H H H H H H H
charge: 0.005925 0.171419 -0.259892 0.002683 -0.622226 -0.181741 0.262680 -0.578920 -0.138979 -0.418938 -0.661286 0.150239 -0.356243 0.294766 0.290885 0.243952 0.291824 0.294797 0.292099 0.247368 0.328583 0.341007
chargesum: 0.00000
title: Mulliken charges with hydrogens summed into heavy atoms:
elementType: Br S O N N C C C C C C C C
charge: 0.005925 0.171419 -0.259892 0.002683 0.047364 -0.181741 0.262680 0.006731 0.104973 -0.127114 -0.074390 0.150239 -0.108876
polarizability: 2.13433915e+02 4.42058826e+00 1.45323527e+02 2.44136125e-01 -9.50947508e-01 6.31112042e+01
1716.lowfreq: -4.3166 -1.3406 -0.0022 -0.0022 -0.0013 5.7530 12.3093 54.0396 63.5919
frequency: 11.6742 54.0352 63.5764 70.6709 114.1795 127.8751 136.9683 204.4932 224.4290 243.1351 304.4760 333.2286 378.9942 436.7549 492.9027 521.1808 566.7781 594.7522 599.6041 603.3017 671.4500 692.3300 710.3269 758.1974 765.1712 782.0097 827.4517 938.2066 942.6814 965.4074 1018.6013 1058.4682 1061.5176 1071.1904 1099.5919 1136.7068 1181.4849 1220.1592 1266.5435 1270.8912 1279.4620 1303.6856 1348.0279 1391.8845 1443.0678 1455.4629 1460.7556 1518.3775 1547.1185 1582.8657 1630.1334 3038.8796 3064.7920 3119.1417 3137.7495 3154.4046 3157.4373 3178.2319 3480.6298 3644.2400
redmass: 10.1503 9.1392 4.9861 2.7225 4.4328 3.0556 10.4009 7.0331 6.0618 5.5241 6.2728 6.5193 3.2022 7.4955 4.6362 2.8047 1.2928 7.5683 1.5749 2.9955 7.1765 5.5682 4.3663 5.3930 4.5877 1.1238 1.3078 1.3042 1.4161 1.4892 4.6696 5.4970 4.6634 1.8987 1.0405 2.1511 2.0267 1.1471 1.5129 1.2138 1.3725 4.1552 2.4981 2.3251 1.9311 1.1000 1.1320 5.8673 6.4910 2.3147 1.8979 1.0563 1.0561 1.1101 1.0897 1.1120 1.0923 1.0945 1.0470 1.1031
irintensity: 4.2944 3.3608 1.5190 3.1363 3.5295 0.8329 1.0381 3.4423 2.2867 6.7720 11.8735 1.2497 2.2772 6.7391 9.2633 8.1326 105.8726 47.1803 125.4779 57.5899 49.5923 3.1569 7.9795 22.2176 17.6343 16.7666 19.7300 3.0344 4.5057 1.7908 4.9787 21.3439 18.3541 5.3872 1.8497 1.9636 6.5500 27.1336 4.7030 2.4134 13.5944 7.8067 126.4343 39.0200 36.7130 7.3759 1.5584 44.3105 92.4713 193.1781 269.8712 3.3924 8.2067 2.0613 11.6515 6.1566 0.5322 11.0803 30.0786 72.4913
temp: 298.150 k
press: 1.00000 atm
elementType: 35 16 8 7 7 6 6 6 6 6 6 6 6 1 1 1 1 1 1 1 1 1
symmnumber: 1
zpe: 421430.9 jmol-1
zpe.correction: 0.160515 hartree
zpe.thermalcorrener: 0.173937 hartree
zpe.thermalcorrenthalpy: 0.174882 hartree
zpe.thermalcorrgfe: 0.116722 hartree
zpe.sumelectzpe: -905.543214 hartree
zpe.sumelectthermal: -905.529791 hartree
zpe.sumelectthermalent: -905.528847 hartree
zpe.sumelectthermalfe: -905.587007 hartree
dipole: 4.7987 -1.4568 -1.1841
dipole: 5.1528
quadrupole: -130.3160 -86.7152 -94.9428
quadrupole: 2.6095 5.2626 4.7307
quadrupole: -26.3247 17.2761 9.0485 2.6095 5.2626 4.7307
hfenergy: -905.7037286 hartree
pointgroup: C01 [X(C8H9Br1N2O1S1)]
dipole: -1.9596749 -0.247527 0.4563411 debye
dipolederiv: -0.6640587 0.0929241 0.0188963 0.2317191 -0.1767753 -0.008886 0.0435723 -0.0086902 -0.1089493 -0.701186 -0.1637384 -0.0630026 -0.4428987 -0.0208385 0.0034581 -0.1567989 0.0116871 -0.0982442 -0.9744985 0.1493332 0.2098205 0.3426621 -0.7080083 -0.0185163 0.1581188 0.0488115 -0.4353067 -0.4730582 0.014736 -0.0309313 -0.0280577 -0.469536 0.0138629 -0.0462535 0.0055409 -0.2517789 -0.7476613 -0.2072406 0.0504038 -0.2686995 -0.750154 0.2161072 0.0043397 0.2292761 -0.7157185 0.9571288 0.2218745 0.1713685 0.7008451 0.2608135 0.0293006 0.1945321 0.0451267 -0.0229739 -0.639802 0.0015922 -0.0519383 -0.1322822 -0.4372672 0.0320193 -0.0180941 -0.0207366 0.0442646 0.301181 -0.1431637 -0.0175521 -0.1510977 -0.0256249 -0.0309107 0.0025332 0.0053059 0.1103507 -0.3066574 -0.2413382 -0.0105395 -0.3790385 -0.4195539 -0.0292614 -0.0422481 -0.0159352 -0.0869049 0.3067793 0.0309713 0.0626792 0.2275948 0.2708195 0.010017 0.0288308 -0.0344895 -0.0324875 0.7741344 -0.271172 -0.0298631 -0.1830118 0.2450181 0.017327 -0.0334894 0.0266954 0.1123424 1.2985971 0.0147117 -0.4562659 -0.146458 1.3638929 -0.2472031 -0.3565831 -0.2471136 0.4408268 0.3971416 0.1490339 0.0585063 -0.0110256 0.3863132 -0.0202539 0.0701044 0.0185046 -0.0496441 0.0003719 0.0114016 -0.0212637 0.0325477 -0.0026394 -0.0677406 -0.0411736 -0.0554103 -0.0069346 -0.0004385 0.0291315 0.011986 0.0490494 -0.0238496 0.0789904 0.0437211 0.0566756 0.0036389 -0.0234608 0.0964684 -0.0333079 0.082845 0.0653337 0.006497 -0.043594 0.01373 0.1366194 0.0289872 0.0475592 -0.0243456 0.025091 0.0940527 0.0099808 -0.0140045 0.0269595 0.1309533 0.0006406 0.0858613 0.0257083 0.024954 -0.0060139 -0.0805044 -0.0235454 -0.0760463 0.006752 0.0021343 0.0961799 -0.0193812 0.037134 -0.0122971 0.0788445 0.0303208 0.0621756 0.0080658 0.0658447 0.026843 -0.0111775 0.0208939 -0.0983904 0.012701 -0.0047809 0.0013106 0.1357645 0.2275515 -0.0646239 0.09799 -0.0505783 0.2622772 -0.0208628 0.1547796 -0.0912244 0.3329296 0.1703289 0.022655 0.0622097 0.0178119 0.2024278 0.0150333 0.0497127 -0.0021533 0.3464347 unknown
polarizability: 210.3035961|-14.8023245|148.3505074|2.496803|-2.7165207|63.2145426 unknown
InChI: InChI=1S/C8H9BrN2OS/c9-2-4-13-7-1-3-11-5-6(7)8(10)12/h1,3,5H,2,4,10H2
charge 0 multiplicity 1
22 atoms
Br -5.509666 0.917994 0.109948
S  -1.223311 -0.802592 -0.300117
O  3.067649 -2.174911 -0.099017
N  2.566862 1.94102 0.23341
N  0.978778 -2.651588 0.773474
C  0.257336 0.267325 -0.040257
C  1.546049 -0.309178 0.166464
C  -2.655307 0.446638 -0.130664
C  0.156684 1.679567 -0.100705
C  2.649759 0.58391 0.279045
C  -3.944499 -0.363578 -0.040057
C  1.91428 -1.777893 0.251265
C  1.318913 2.464183 0.048174
H  -2.490291 1.038947 0.78332
H  -2.658672 1.100642 -1.016454
H  -0.796026 2.184378 -0.276134
H  3.647056 0.150622 0.406066
H  -4.144464 -0.958532 -0.943635
H  -3.993297 -0.991524 0.86145
H  1.254913 3.557226 0.004413
H  0.053945 -2.354261 1.088434
H  1.239207 -3.636098 0.833177
