program: Gaussian 09
title: 000202686
version: EM64L-G09RevD.01
frameworkgroup: C1[X(C9H10ClNO2S)]
method: RPBEPBE
basis: SDD
operation: Freq
keyword: #p
keyword: freq=noraman
keyword: PBEPBE/SDD
title: #p freq=noraman PBEPBE/SDD
converged: YES YES NO NO
title: Mulliken charges:
elementType: Cl S O O N C C C C C C C C C H H H H H H H H H H
charge: -0.069426 0.217643 -0.274867 -0.231179 0.007784 -0.209569 0.257415 -0.599770 -0.185147 -0.414207 -0.520917 0.155434 -0.314418 -0.494336 0.273488 0.317066 0.263267 0.284455 0.273929 0.276433 0.252264 0.250098 0.233588 0.250972
chargesum: 0.00000
title: Mulliken charges with hydrogens summed into heavy atoms:
elementType: Cl S O O N C C C C C C C C C
charge: -0.069426 0.217643 -0.274867 -0.231179 0.007784 -0.209569 0.257415 -0.009216 0.078120 -0.129752 0.029445 0.155434 -0.062153 0.240322
polarizability: 1.62203773e+02 1.36113537e+01 1.54516682e+02 9.47580227e+00 5.49885134e-01 9.82857387e+01
1716.lowfreq: -11.7638 -10.6142 -5.0437 -0.0023 -0.0015 -0.0014 26.9370 31.9559 38.7191
frequency: 26.5191 31.8609 38.5640 76.8357 91.6403 106.4253 115.0970 138.8967 191.2469 192.9031 220.4246 257.6566 291.2731 302.5879 334.7672 398.5709 413.3405 494.5855 547.5610 628.1360 665.1229 667.2449 691.0913 701.9202 761.6462 773.5154 787.5950 852.7358 902.1881 943.1501 971.7848 977.4689 1010.6698 1054.1372 1067.7706 1092.6998 1107.4743 1111.3882 1150.9377 1174.9978 1215.8555 1231.9339 1256.2328 1277.3169 1286.1286 1298.1504 1386.3347 1421.1500 1444.6844 1451.7390 1457.5629 1457.8248 1462.7053 1517.0870 1547.7968 1615.0392 3010.4156 3054.4825 3066.6145 3116.1814 3136.6044 3142.4749 3151.4305 3154.3000 3160.7028 3173.6569
redmass: 7.2839 8.9902 5.7191 2.2920 2.3045 2.7400 1.6725 4.1679 4.9302 4.6548 6.2171 5.9974 9.2216 6.8772 4.3508 4.3602 9.9194 5.3902 5.5577 9.0352 7.2481 5.2278 7.2537 6.8537 2.4854 1.4712 4.8092 1.3155 7.7572 1.5168 1.3814 1.4659 4.5184 5.1876 4.5434 2.3094 1.1568 1.2616 1.4865 2.1638 1.1915 2.0684 1.1964 1.2479 1.7789 9.8795 1.7576 1.2174 1.9980 1.0513 1.0987 1.1095 1.0532 5.8619 6.8824 10.1680 1.0290 1.0607 1.0559 1.1051 1.1075 1.0892 1.0927 1.1054 1.1107 1.0969
irintensity: 1.6410 1.2895 0.9270 1.7600 1.0229 1.1102 0.0984 1.4886 4.7099 4.2429 7.4780 4.5987 3.1945 2.7909 5.8521 2.9237 1.6771 10.8185 22.2703 76.4097 8.1435 3.8486 10.9372 9.6899 10.6072 3.2557 7.6027 34.0164 5.9705 4.7111 3.0534 1.3807 54.0446 8.9005 1.7338 90.5282 16.9318 0.1591 33.3086 3.1550 0.3945 113.6767 3.2932 18.5039 53.9235 23.8417 17.6708 29.6548 5.9125 13.3038 13.3440 0.8093 9.0299 22.3409 75.9371 231.6204 27.1973 3.2863 11.6618 17.8387 4.5804 12.9723 1.1506 10.6938 6.4093 8.2623
temp: 298.150 k
press: 1.00000 atm
elementType: 17 16 8 8 7 6 6 6 6 6 6 6 6 6 1 1 1 1 1 1 1 1 1 1
symmnumber: 1
zpe: 459717.9 jmol-1
zpe.correction: 0.175097 hartree
zpe.thermalcorrener: 0.190047 hartree
zpe.thermalcorrenthalpy: 0.190991 hartree
zpe.thermalcorrgfe: 0.130004 hartree
zpe.sumelectzpe: -1411.219158 hartree
zpe.sumelectthermal: -1411.204208 hartree
zpe.sumelectthermalent: -1411.203264 hartree
zpe.sumelectthermalfe: -1411.264251 hartree
dipole: 1.7329 0.6471 1.2888
dipole: 2.2545
quadrupole: -117.9665 -82.0366 -100.1809
quadrupole: -1.0051 3.2895 -3.5590
quadrupole: -17.9052 18.0248 -0.1196 -1.0051 3.2895 -3.5590
hfenergy: -1411.3942553 hartree
pointgroup: C01 [X(C9H10Cl1N1O2S1)]
dipole: -0.8357427 0.1675761 0.2454186 debye
dipolederiv: -0.4135006 0.0787779 -0.2735764 0.0457671 -0.201039 0.0373026 -0.4108057 0.1392135 -0.6167865 -0.3099893 0.0450088 -0.1602287 -0.010934 -0.1312852 0.1270655 -0.1465561 0.1604215 -0.1036487 -1.1297697 -0.4776678 -0.171362 -0.2413391 -0.7750146 0.0304538 -0.2407914 -0.0776191 -0.287773 -0.6503054 0.0205936 -0.124217 0.2765997 -0.9009234 0.1852197 -0.1557249 0.0518162 -0.3602443 -0.373015 -0.0492064 0.00022 0.0369657 -0.4240243 -0.0035315 0.0749366 -0.0126616 -0.2469556 0.6661424 -0.1907588 -0.0545355 0.1053595 0.2639465 -0.0241147 -0.1969886 0.0035698 -0.1533154 -0.451672 0.0155227 0.0659384 -0.1358736 -0.4437292 0.025542 0.1833659 0.0176011 0.0234375 0.1862862 0.0099459 0.1438603 0.0642558 0.0043591 -0.0810616 0.2314966 -0.0805396 0.1427032 -0.5213759 -0.2465297 0.0349089 -0.1286012 -0.1124973 0.029829 0.0653915 0.0509979 -0.0550071 0.2711412 -0.0207471 -0.093817 0.0249437 0.1716621 0.0136262 -0.0747319 0.0726628 -0.0064477 0.3829305 -0.068396 0.2835102 -0.1443896 0.1662519 -0.0591297 0.4321478 -0.0758328 0.6701763 1.4362479 0.4672885 0.3292974 -0.0447962 1.4049843 -0.2502925 0.367369 -0.0472642 0.3313511 0.3433811 0.2267027 -0.0556999 -0.0285474 0.3080534 0.0298736 -0.1631928 -0.0447003 -0.0149627 0.3617563 0.2084722 -0.0147307 0.226452 0.5245357 0.0102857 0.0017395 0.0257131 0.2525149 -0.0647659 -0.0392398 0.0411529 -0.0134196 0.0826274 0.0407434 -0.0278565 0.0338722 0.0370133 0.0863572 -0.0128742 -0.0017913 -0.0045692 0.0553471 -0.0338566 -0.0047223 -0.0767188 -0.000302 0.0916935 0.0808201 0.0356434 0.0530445 -0.0096955 -0.0098862 0.0417418 -0.0252111 0.1287315 0.0738208 0.0408665 0.0182777 0.0351147 0.0034018 -0.0244951 -0.0028223 -0.0438803 0.1294595 0.0246911 0.0453587 -0.0347852 0.053989 -0.0226867 -0.0316219 -0.0131725 -0.0903109 -0.0281735 -0.0747656 -0.0661037 0.0222892 -0.0322192 0.0701271 0.013323 -0.0077594 -0.0093434 -0.0010884 0.0452961 -0.0730957 0.013911 -0.0715805 -0.065632 0.0004233 0.0358341 0.0207282 0.1265535 0.0312679 0.0574816 0.0825922 -0.0326825 -0.0458731 -0.0614633 0.0518814 -0.068199 0.0214129 -0.0877726 -0.0341286 -0.053255 0.0368046 0.0797785 0.0183366 -0.0613681 0.0030061 0.0944365 0.0759197 -0.0180913 -0.0336031 -0.070344 -0.0026745 0.0174286 0.0205884 0.0726785 -0.0830855 unknown
polarizability: 170.4966768|5.432957|144.7558223|12.4577813|-5.1326732|99.7536953 unknown
InChI: InChI=1S/C9H10ClNO2S/c1-13-9(12)7-6-11-4-2-8(7)14-5-3-10/h2,4,6H,3,5H2,1H3
charge 0 multiplicity 1
24 atoms
Cl -3.524378 1.768747 -2.814001
S  -1.338611 0.985285 1.095378
O  -0.812931 -1.850881 -0.124616
O  1.232035 -2.724751 0.552724
N  3.113155 0.912246 -0.442002
C  0.368591 0.870541 0.387014
C  1.058669 -0.343047 0.098663
C  -2.41929 0.752627 -0.459657
C  1.08567 2.08489 0.256773
C  2.424738 -0.251884 -0.30327
C  -2.430256 2.033979 -1.279913
C  0.529778 -1.738288 0.224538
C  2.435588 2.064292 -0.158665
C  -1.388671 -3.21656 -0.008755
H  -3.419893 0.510879 -0.065331
H  -2.022107 -0.111368 -1.009287
H  0.595917 3.033283 0.493537
H  2.976652 -1.175324 -0.508389
H  -2.877739 2.882803 -0.743594
H  -1.437004 2.295673 -1.673169
H  3.003539 2.995231 -0.262329
H  -0.838338 -3.915482 -0.659876
H  -2.433097 -3.107222 -0.331642
H  -1.326913 -3.563268 1.035771
