program: Gaussian 09
title: 000202670
version: EM64L-G09RevD.01
frameworkgroup: C1[X(C9H12N2O2)]
method: RPBEPBE
basis: SDD
operation: Freq
keyword: #p
keyword: freq=noraman
keyword: PBEPBE/SDD
title: #p freq=noraman PBEPBE/SDD
converged: NO YES NO NO
title: Mulliken charges:
elementType: O O N N C C C C C C C C C H H H H H H H H H H H H
charge: -0.214925 -0.215039 -0.548027 0.025530 -0.582152 -0.096493 0.529086 -0.697932 -0.388265 -0.367529 -0.360072 -0.361542 0.369115 0.205847 0.211543 0.227142 0.247096 0.193917 0.231110 0.245940 0.243297 0.268552 0.265126 0.284336 0.284340
chargesum: 0.00000
title: Mulliken charges with hydrogens summed into heavy atoms:
elementType: O O N N C C C C C C C C C
charge: -0.214925 -0.215039 -0.014349 0.025530 -0.164763 0.130649 0.529086 -0.025809 -0.142325 -0.124232 -0.075735 -0.077202 0.369115
polarizability: 2.25870009e+02 4.73074456e+00 1.18366984e+02 1.07652976e+01 -7.30135333e+00 7.13953273e+01
1716.lowfreq: -4.1355 -0.0007 -0.0006 -0.0002 6.5551 12.4299 43.2119 53.2268 65.8518
frequency: 42.6052 53.1125 65.8035 73.9688 147.1045 208.1686 242.2064 258.5390 277.2999 290.8253 352.9609 395.7225 400.0577 409.5233 451.0959 505.3891 508.4689 557.7499 627.9214 635.6965 670.8762 726.9735 769.5649 811.4375 826.1840 849.7429 873.0555 884.2178 933.8637 984.6586 990.4030 993.1972 1004.9933 1066.2764 1094.1231 1109.4320 1133.0402 1170.6395 1180.1017 1218.5685 1222.0014 1235.9112 1280.1342 1299.8679 1320.8568 1358.6697 1365.9164 1388.4634 1403.3566 1419.4910 1465.1038 1472.8351 1478.6620 1479.8883 1591.7503 1605.9965 1637.2917 2976.3758 2978.9482 2988.3212 3043.8983 3075.5955 3105.6798 3134.4008 3139.2375 3180.9680 3183.2994 3454.1660 3584.3334
redmass: 3.4955 5.3105 4.5736 5.0793 5.3653 3.6945 1.2092 1.0933 3.8085 3.9899 2.8210 2.3943 3.5558 2.9061 2.1590 3.7787 5.3414 1.5189 6.8305 6.1625 4.7739 4.3930 7.1342 2.3840 4.7225 1.2483 1.9445 1.4540 1.7982 1.3306 1.3900 1.3708 3.0312 1.5964 3.3076 1.5911 1.5546 1.6842 1.3715 2.9677 5.0315 1.4009 1.4372 1.2967 1.2132 4.6235 1.6009 1.2980 7.3855 3.2499 1.1098 1.0469 1.1813 1.9759 7.6083 6.2080 1.0994 1.0465 1.0608 1.0763 1.1033 1.0943 1.1005 1.0903 1.0905 1.0941 1.0953 1.0444 1.0982
irintensity: 0.6082 0.8211 0.5072 0.4025 2.3506 0.4419 1.0297 47.6562 6.7409 2.1818 0.2709 20.1919 0.5346 0.0855 3.4075 8.4942 2.9305 455.7829 0.3919 6.5218 28.0070 14.8705 12.0036 16.5130 11.3340 0.3544 34.4883 17.5784 33.4434 5.4015 8.0698 0.9166 1.8329 62.7585 16.3835 34.2734 18.0064 169.7629 55.4454 2.1611 381.8490 1.3987 22.6731 0.2365 14.8553 80.7376 21.4708 20.8514 3.9257 40.7902 3.5904 7.3344 10.2861 3.9340 2.5704 116.4586 46.8608 13.2231 32.9739 33.7266 24.3881 38.1659 27.0670 12.5128 7.9937 0.0935 3.6839 9.2829 0.7785
temp: 298.150 k
press: 1.00000 atm
elementType: 8 8 7 7 6 6 6 6 6 6 6 6 6 1 1 1 1 1 1 1 1 1 1 1 1
symmnumber: 1
zpe: 524365.0 jmol-1
zpe.correction: 0.199720 hartree
zpe.thermalcorrener: 0.212451 hartree
zpe.thermalcorrenthalpy: 0.213395 hartree
zpe.thermalcorrgfe: 0.159794 hartree
zpe.sumelectzpe: -609.049705 hartree
zpe.sumelectthermal: -609.036974 hartree
zpe.sumelectthermalent: -609.036030 hartree
zpe.sumelectthermalfe: -609.089631 hartree
dipole: -6.3098 -0.0684 -2.0243
dipole: 6.6269
quadrupole: -97.9511 -71.7433 -78.8354
quadrupole: -0.7470 4.6136 0.0837
quadrupole: -15.1079 11.1000 4.0078 -0.7470 4.6136 0.0837
hfenergy: -609.2494254 hartree
pointgroup: C01 [X(C9H12N2O2)]
dipole: 2.4580283 -0.2363206 0.8366053 debye
dipolederiv: -0.8203764 0.2303175 -0.0248684 0.4454669 -0.6719374 -0.1021439 0.0076149 -0.0998132 -0.2787291 -0.8401458 -0.1453172 -0.1636461 -0.3434955 -0.578861 -0.1644562 -0.2839699 -0.1627329 -0.3376654 -1.2963797 0.1291393 0.2204606 0.2132196 -0.2213412 0.0354391 0.4580489 0.0165605 -0.5833174 2.1509063 -0.1470011 0.3054045 -0.1837267 0.9938649 0.2624478 0.4526705 0.2540559 0.3647095 -0.7388907 0.0695071 0.0765421 -0.019885 0.1203368 0.0611785 0.707132 0.0087395 -0.0156835 1.1714461 -0.1069575 -0.1091991 -0.1008489 0.2215512 -0.0364466 -0.6987613 -0.0268894 0.3969921 0.8850295 -0.0381886 0.0411643 -0.0921136 0.054733 0.0225625 0.273955 0.0096332 -0.0543139 0.0028321 0.028047 0.0191188 0.0860043 -0.0534409 0.0994361 0.0991798 0.110547 0.007819 -0.446064 0.1490225 0.0459204 0.3818675 -0.0080287 0.0945015 -0.0160551 0.080664 -0.0949112 -0.4339282 -0.1126095 -0.0464128 -0.2994164 0.0570483 0.0253605 -0.2230841 0.0527878 -0.1496903 0.3596004 -0.1080614 0.0208726 0.2076687 -0.0365234 0.0557737 0.1852791 -0.0042322 -0.0636067 0.324117 0.0397847 0.0739344 -0.2466009 -0.0117148 -0.0190472 0.0035876 0.0422675 -0.0785313 -1.0124372 0.0776215 -0.1229342 0.0771134 -0.0014375 0.0004086 -0.2550026 0.0062815 0.0065421 -0.0110923 -0.0206808 -0.0412523 -0.0634151 -0.0371787 -0.1339754 -0.0813314 -0.0657537 -0.0149387 -0.0145031 0.0206322 -0.0249612 0.0609214 -0.1086129 0.1103304 -0.09094 0.0665131 0.0245354 -0.0117485 -0.0521535 -0.050786 -0.077174 -0.0723875 -0.0860747 0.0195443 -0.067209 -0.0451815 0.0011775 -0.0335399 0.1242748 -0.0169264 0.0841761 0.0089876 0.1268587 0.0350019 -0.0697416 0.0454959 -0.0587873 -0.0514116 -0.0447134 -0.0389419 -0.0693199 -0.1033885 -0.1351278 -0.0417594 -0.1009602 0.0691228 -0.0715108 0.0461049 0.0518893 0.0070055 -0.0744115 -0.0076512 0.0909769 0.0254866 -0.0760058 -0.0649992 -0.0629677 -0.0016142 -0.061084 -0.056948 -0.0633644 0.1022195 0.0275435 0.0981624 -0.0022194 0.0808333 -0.0238937 -0.0359426 0.004402 -0.037617 0.1203783 0.2735496 -0.0465162 -0.0640857 -0.0591829 0.0552615 0.0960786 -0.2197755 0.1695172 0.2273516 0.2802113 0.0253822 -0.064266 0.007488 0.0923934 -0.1000726 -0.2198804 -0.1100876 0.1857488 0.0904555 0.0617506 0.0088069 0.0207891 0.0605753 -0.0324696 0.0045822 -0.0250594 0.1562291 0.088675 -0.052671 -0.0339468 -0.0170107 0.074084 -0.0384776 -0.0193067 -0.0470312 0.1445679 unknown
polarizability: 224.7830334|-10.4072425|115.4636195|13.6690971|13.7093249|75.3856675 unknown
InChI: InChI=1S/C9H12N2O2/c1-7(10)6-8-2-4-9(5-3-8)11(12)13/h2-5,7H,6,10H2,1H3
charge 0 multiplicity 1
25 atoms
O  -3.831638 1.323936 -0.050353
O  -3.85396 -0.817786 -0.837752
N  4.727691 -0.538726 -0.116943
N  -3.250811 0.197939 -0.310757
C  2.410178 -0.329825 0.915631
C  3.31434 -0.224107 -0.38017
C  0.928765 -0.193218 0.63425
C  3.220817 1.17097 -1.02654
C  0.233855 1.019983 0.893195
C  0.207935 -1.274138 0.05274
C  -1.133482 1.15947 0.58955
C  -1.157929 -1.15739 -0.26233
C  -1.813426 0.064421 0.011213
H  2.747579 0.447328 1.628536
H  2.61695 -1.315452 1.377245
H  2.936424 -0.974138 -1.103837
H  3.83259 1.199487 -1.943623
H  3.601026 1.948649 -0.3344
H  2.179138 1.426342 -1.284487
H  0.774097 1.860659 1.342928
H  0.725358 -2.220422 -0.143932
H  4.909179 -1.481013 0.241912
H  5.233816 0.184016 0.404685
H  -1.680464 2.084457 0.790024
H  -1.723829 -1.981046 -0.705487
