program: Gaussian 09
title: 000016870
version: EM64L-G09RevD.01
frameworkgroup: C1[X(C12H11NO2)]
method: RPBEPBE
basis: SDD
operation: Freq
keyword: #p
keyword: freq=noraman
keyword: PBEPBE/SDD
title: #p freq=noraman PBEPBE/SDD
converged: YES YES NO NO
title: Mulliken charges:
elementType: O O N C C C C C C C C C C C C H H H H H H H H H H H
charge: -0.222111 -0.236469 -0.135401 0.382495 0.296310 0.296615 -0.131968 -0.533562 -0.035039 -0.366371 -0.373592 -0.659617 -0.653267 -0.231825 -0.225898 0.268634 0.286135 0.291768 0.309880 0.232293 0.226645 0.240110 0.254910 0.243752 0.237567 0.238005
chargesum: 0.00000
title: Mulliken charges with hydrogens summed into heavy atoms:
elementType: O O N C C C C C C C C C C C C
charge: -0.222111 -0.236469 -0.135401 0.382495 0.296310 0.296615 -0.131968 -0.264928 -0.035039 -0.080236 -0.081823 0.109202 0.085505 0.005742 0.012107
polarizability: 2.32762793e+02 1.50357748e+01 1.67635009e+02 3.40710023e-01 1.20981579e+00 6.48492508e+01
1716.lowfreq: -9.3864 -0.0008 -0.0007 -0.0003 3.1211 11.0008 35.9284 39.9000 94.4322
frequency: 35.8631 39.8036 94.4115 118.7319 145.7573 183.3770 201.6213 227.1348 275.4712 292.6994 323.5027 366.8039 398.9573 405.8819 443.2126 450.0152 472.2987 511.8558 521.2951 624.4218 663.3649 676.3944 701.2247 729.3245 789.7388 803.4509 831.1521 844.7120 868.8715 927.8357 979.5039 994.7536 1012.6082 1032.8479 1052.8466 1077.4065 1088.0001 1127.5474 1134.2265 1149.2238 1171.1627 1206.8465 1233.7420 1267.8121 1309.0800 1337.6744 1392.7789 1400.1183 1423.3433 1438.2411 1442.3720 1465.6920 1472.1952 1479.2094 1483.4508 1499.3780 1522.8053 1545.3666 1566.6454 1604.0768 1608.9423 2957.4336 2965.9267 3039.0213 3045.1024 3107.8635 3134.7820 3150.8288 3159.9061 3162.4769 3171.3238 3177.3618
redmass: 4.7981 2.9260 1.3128 3.6487 3.6593 2.8046 3.3625 2.0160 3.0469 3.1998 4.1912 5.4502 5.6715 3.4592 5.1505 4.6099 6.4318 3.9042 4.2628 6.1040 3.3744 5.9415 6.3328 3.2760 1.4746 4.8371 2.4343 5.3209 1.9653 1.6891 3.9272 1.3924 1.3563 2.0584 1.5900 3.0100 1.2454 2.0960 1.3659 1.8199 1.0905 2.4235 2.0643 1.9904 2.0506 4.0821 3.4526 8.0734 1.1914 1.9792 1.4174 1.1548 2.6652 1.1181 1.2771 1.0500 3.7008 7.5728 5.2676 7.0500 6.7665 1.0397 1.0410 1.0996 1.0955 1.0992 1.0862 1.0903 1.0952 1.0944 1.0999 1.0896
irintensity: 6.8521 2.4314 2.8032 0.3009 2.2425 0.6458 1.1779 2.8289 4.5651 1.6399 0.5977 5.9181 16.8053 1.7011 2.6291 3.6736 7.4029 3.2010 1.7593 4.6908 3.0928 0.9185 0.2240 25.2129 82.6767 6.7864 1.4657 0.9873 22.0087 0.6907 114.6126 3.8110 0.2802 0.5998 39.9377 4.4944 1.2696 6.8458 17.4780 95.8535 1.8563 12.3447 17.2608 52.4715 210.2339 38.5478 60.5636 2.0524 41.8063 0.5394 9.3672 16.7056 7.3608 15.1473 11.5775 24.4436 11.3892 393.3112 247.4837 54.3031 16.2612 22.4612 132.8163 34.2605 23.3585 17.3881 4.8162 7.7936 13.1540 2.0738 29.0321 5.9461
temp: 298.150 k
press: 1.00000 atm
elementType: 8 8 7 6 6 6 6 6 6 6 6 6 6 6 6 1 1 1 1 1 1 1 1 1 1 1
symmnumber: 1
zpe: 529713.1 jmol-1
zpe.correction: 0.201757 hartree
zpe.thermalcorrener: 0.214976 hartree
zpe.thermalcorrenthalpy: 0.215920 hartree
zpe.thermalcorrgfe: 0.161269 hartree
zpe.sumelectzpe: -668.004931 hartree
zpe.sumelectthermal: -667.991712 hartree
zpe.sumelectthermalent: -667.990768 hartree
zpe.sumelectthermalfe: -668.045419 hartree
dipole: -2.6059 -2.0587 0.3448
dipole: 3.3388
quadrupole: -58.9240 -100.3831 -89.7571
quadrupole: -8.0121 -0.5329 -1.3788
quadrupole: 24.0974 -17.3617 -6.7358 -8.0121 -0.5329 -1.3788
hfenergy: -668.2066881 hartree
pointgroup: C01 [X(C12H11N1O2)]
dipole: 1.01691 0.7811614 0.2849377 debye
dipolederiv: -0.8010752 -0.1189539 -0.0223344 -0.3834608 -0.886884 -0.0691582 -0.0890568 -0.0693791 -0.312628 -0.7923324 -0.1373951 -0.0275949 -0.3902369 -0.9585964 -0.1148162 -0.0488828 -0.1052147 -0.3610878 -1.2309882 -0.3830791 -0.0948977 -0.244561 -0.4539509 -0.0232505 0.1726848 0.0414513 -0.2534083 1.0440411 0.6474438 0.1151224 0.9560683 -0.1034708 -0.0704235 0.1195259 -0.0991804 0.0762229 -0.7284525 -0.0987045 -0.0029277 -0.0843367 -0.0475664 -0.0032739 0.0010439 -0.0236166 -0.0057303 -0.057122 0.1676547 0.0285463 0.320932 -0.1790448 -0.0440879 0.0507477 -0.0436564 0.0229905 1.3699525 -0.1078357 -0.0419415 0.2543707 1.0830319 0.1172281 0.0487028 0.1688104 0.1856258 -1.1421288 -0.3038527 -0.0550124 -0.7532148 -0.2047837 0.0033818 -0.1789558 -0.0351439 -0.2656975 1.7101224 0.2156468 0.0390987 0.1693929 0.8568985 0.135721 -0.0014138 0.1398703 0.1582498 -0.020181 0.1808233 0.0291209 -0.0654246 0.0456372 0.0297633 -0.0045481 0.0215496 -0.100653 -0.27724 0.0485561 0.0115829 0.1887791 0.0650467 0.0287133 0.0371292 0.0312152 -0.1058559 0.0983958 0.1816581 0.0863203 0.4821727 0.3163662 0.0435614 0.078428 -0.0264674 0.2414442 0.3742394 -0.0291329 -0.0093035 -0.3246176 0.1745613 -0.0484518 -0.1217304 -0.0462586 0.2132332 0.0159811 -0.1950777 -0.0371574 -0.104098 -0.0004005 0.0316245 -0.0216501 0.0335114 -0.1509806 0.2408789 0.0570383 0.002403 -0.0338876 0.0076679 0.0266823 -0.014356 0.0256818 -0.1327502 -0.0289374 0.0587026 0.0077018 0.0940172 0.0170714 -0.023523 0.0126879 -0.0184218 0.1630782 0.106794 -0.0726901 -0.0126526 -0.0011156 0.010793 -0.0266568 -0.0035788 -0.0219645 0.1489885 0.1360234 0.0069202 0.0030201 -0.0738772 0.0128923 -0.0244937 -0.0105295 -0.0251555 0.1520912 0.2583845 0.1074917 0.0594023 -0.0121238 0.0536923 -0.047628 0.0500049 -0.0191887 0.1203462 -0.0643472 -0.1220089 0.0692704 -0.1181942 0.0371434 0.0121284 0.1205717 0.071343 -0.0361494 -0.055948 -0.0540963 -0.1297879 -0.0463128 0.0131836 0.0799154 -0.2182802 -0.0153782 -0.0780305 -0.1249413 -0.039808 0.0233439 -0.1202349 0.064765 0.0195312 0.0144345 0.007945 0.1176436 0.0779088 -0.0408654 -0.0921614 0.0661078 0.0321938 -0.0717447 0.0155507 -0.0464972 -0.0589538 0.0337532 -0.0319383 0.03097 0.1473195 -0.0354676 0.0823709 -0.0305606 0.0990403 -0.0441148 -0.0187478 0.0966024 0.0205706 0.1152157 -0.0100851 -0.0321361 0.0235552 -0.0334904 0.1530081 -0.1240335 -0.0330993 -0.0007021 -0.038679 0.089306 -0.0109773 -0.0015242 -0.011405 0.1531179 unknown
polarizability: 232.4306731|15.597266|164.7705995|2.1585451|17.9064731|68.0457809 unknown
InChI: InChI=1S/C12H11NO2/c1-13(2)10-7-11(14)8-5-3-4-6-9(8)12(10)15/h3-7H,1-2H3
charge 0 multiplicity 1
26 atoms
O  0.899773 2.270966 0.231287
O  -0.709845 -2.936994 -0.546547
N  2.921323 0.182375 -0.031444
C  1.558814 -0.075167 -0.050433
C  -0.900239 0.696485 0.091041
C  -1.339675 -0.636281 -0.135675
C  0.550992 1.052296 0.111144
C  1.072868 -1.36999 -0.284051
C  -0.332525 -1.72688 -0.345039
C  -1.855128 1.72703 0.289677
C  -2.721281 -0.929517 -0.161525
C  3.584745 1.390788 0.509238
C  3.8460 -0.91522 -0.370304
C  -3.232459 1.429393 0.265762
C  -3.666885 0.098855 0.039933
H  1.753626 -2.214903 -0.411956
H  -1.494481 2.746615 0.457111
H  -3.022695 -1.966553 -0.339727
H  2.844103 2.154988 0.766692
H  4.271507 1.810354 -0.249815
H  4.177992 1.118642 1.404936
H  4.865472 -0.507645 -0.453823
H  3.569651 -1.374336 -1.336904
H  3.847375 -1.709416 0.404122
H  -3.967189 2.226646 0.420557
H  -4.73794 -0.130332 0.021043
