program: Gaussian 09
title: 000202645
version: EM64L-G09RevD.01
frameworkgroup: C1[X(C14H20N2O4)]
method: RPBEPBE
basis: SDD
operation: Freq
keyword: #p
keyword: freq=noraman
keyword: PBEPBE/SDD
title: #p freq=noraman PBEPBE/SDD
converged: YES YES NO NO
title: Mulliken charges:
elementType: O O O O N N C C C C C C C C C C C C C C H H H H H H H H H H H H H H H H H H H H
charge: -0.245049 -0.272394 -0.414236 -0.344314 -0.084273 -0.463879 -0.337860 -0.563118 0.210257 0.552458 -0.614152 -0.619733 -0.610729 -0.369041 0.074206 0.198525 -0.326769 0.242557 -0.220128 -0.671545 0.183931 0.261927 0.262576 0.218862 0.312418 0.188802 0.221594 0.231876 0.226702 0.224646 0.187626 0.250191 0.310738 0.265939 0.232613 0.232557 0.387407 0.214282 0.232226 0.232305
chargesum: 0.00000
title: Mulliken charges with hydrogens summed into heavy atoms:
elementType: O O O O N N C C C C C C C C C C C C C C
charge: -0.245049 -0.272394 -0.026830 -0.344314 -0.084273 -0.151461 0.107998 -0.081680 0.210257 0.552458 0.028120 0.019241 -0.360538 -0.058303 0.074206 0.198525 -0.060830 0.242557 0.245042 0.007268
polarizability: 3.22971307e+02 1.99456832e+00 1.84023594e+02 5.94423477e+00 1.59875330e+00 1.03292495e+02
1716.lowfreq: -5.9260 -1.8493 -0.0007 0.0009 0.0012 4.8960 15.7612 25.1033 36.6895
frequency: 15.7502 25.0427 36.6809 41.8477 57.2664 73.0903 83.9094 103.9167 113.1981 124.6490 156.2447 165.2931 182.1819 227.5993 236.4048 241.7640 250.0362 263.2696 280.9488 303.0527 313.6393 325.4473 341.0867 390.3292 425.0551 447.8583 454.1773 466.4244 511.5912 568.4600 575.5745 615.4563 637.7937 674.2096 685.0701 700.7484 749.2252 771.9759 790.3638 797.5179 798.7038 833.0938 837.6385 854.0941 864.8594 875.6320 915.2685 973.9901 994.7080 1017.5268 1024.8351 1032.8910 1039.8499 1067.7620 1074.5417 1091.9161 1113.2489 1128.8552 1135.6529 1141.9400 1150.4146 1175.2872 1202.9167 1216.7480 1232.0012 1251.0265 1268.3286 1275.4332 1293.9347 1307.1585 1324.8202 1342.4476 1368.7472 1375.9806 1391.5389 1404.1131 1419.9018 1431.2378 1442.4278 1445.1377 1462.7766 1463.8281 1468.1092 1472.7551 1476.7760 1479.9465 1485.6727 1486.6142 1492.7482 1494.3827 1563.5812 1585.6680 1628.4310 1655.6190 2841.9142 2846.2769 2866.6069 2972.9146 2981.5013 2997.6374 3014.6950 3022.4327 3026.2784 3037.4164 3058.8364 3074.1080 3079.9883 3083.8106 3094.3434 3110.1414 3144.1613 3166.8739 3208.0340 3524.4149
redmass: 4.4579 2.8149 2.6638 3.9294 5.0078 3.9636 3.4363 2.8580 3.1003 4.3840 3.8667 3.7465 4.4760 1.1758 2.3514 1.2529 1.7106 3.2951 4.1188 5.9359 4.8327 4.1567 2.4216 4.9814 2.9779 3.3927 2.9005 3.4939 5.1105 6.4220 3.8944 3.3898 4.9536 1.9424 2.3010 5.9445 3.4400 2.6036 4.0709 2.7661 1.1108 3.5532 3.4117 1.4920 1.2849 1.3821 5.3443 3.8388 1.3108 2.3146 2.4450 1.4896 1.9312 5.4290 2.4266 1.3993 2.2313 1.3791 1.4611 1.6662 1.7653 1.7502 1.6506 1.6724 1.8585 1.1325 2.6811 2.1453 1.3977 2.3042 1.6681 1.6658 2.0463 1.4575 3.3261 1.3844 1.1408 4.4246 1.1491 1.1077 1.0498 1.0399 1.0648 1.0658 1.0514 1.0822 1.1743 1.0605 2.0266 2.6649 4.9701 4.2899 4.4383 5.1789 1.0684 1.0580 1.0583 1.0691 1.0584 1.0359 1.0582 1.0728 1.0721 1.0952 1.0932 1.1066 1.1009 1.1007 1.0985 1.1030 1.0921 1.0907 1.0953 1.0764
irintensity: 0.2066 1.4600 0.2103 0.2789 0.9773 8.2298 2.0210 0.3356 0.7667 2.3832 2.2287 8.2897 1.5903 0.7460 0.7441 2.0868 0.3909 2.4876 5.5130 3.8894 6.6874 3.0150 8.3066 35.1935 7.4820 1.8796 7.4466 0.0609 9.4906 2.9038 4.6659 8.2514 5.4194 63.3535 0.7836 16.1686 0.2259 0.6236 3.9345 2.5837 3.6346 17.7774 12.2519 0.7569 240.1209 0.0225 14.9738 8.2055 1.2490 19.3585 83.1769 6.4406 44.3648 189.4017 142.9115 17.8713 2.5869 5.2648 5.7937 81.1906 67.2884 30.1279 167.4910 11.2101 123.3570 0.0100 11.0392 501.2439 45.7395 14.9659 22.8675 474.8406 208.9636 149.4809 43.5035 29.3429 2.8292 119.2663 12.5971 5.3085 16.8670 12.6480 3.2155 6.3834 18.7635 13.3646 74.2339 27.7924 279.7253 93.2152 46.9370 222.4636 137.0488 361.4666 53.2047 82.5920 226.4064 353.1309 15.4447 17.7934 21.6565 39.3427 49.9477 9.0196 17.9974 5.8885 26.4203 61.1341 29.8847 42.6946 6.7810 1.7371 6.9554 13.3542
temp: 298.150 k
press: 1.00000 atm
elementType: 8 8 8 8 7 7 6 6 6 6 6 6 6 6 6 6 6 6 6 6 1 1 1 1 1 1 1 1 1 1 1 1 1 1 1 1 1 1 1 1
symmnumber: 1
zpe: 853715.3 jmol-1
zpe.correction: 0.325163 hartree
zpe.thermalcorrener: 0.346407 hartree
zpe.thermalcorrenthalpy: 0.347351 hartree
zpe.thermalcorrgfe: 0.272230 hartree
zpe.sumelectzpe: -954.382336 hartree
zpe.sumelectthermal: -954.361092 hartree
zpe.sumelectthermalent: -954.360148 hartree
zpe.sumelectthermalfe: -954.435270 hartree
dipole: -0.8849 -0.0202 0.7885
dipole: 1.1854
quadrupole: -89.7692 -123.1906 -122.2561
quadrupole: -22.6166 -4.8459 -1.5425
quadrupole: 21.9694 -11.4520 -10.5174 -22.6166 -4.8459 -1.5425
hfenergy: -954.7074994 hartree
pointgroup: C01 [X(C14H20N2O4)]
dipole: -0.3473801 -0.0312855 0.3096094 debye
polarizability: 323.0210094|-1.7508234|182.8894671|5.2139188|9.5407681|104.3769193 unknown
InChI: InChI=1S/C14H20N2O4/c1-4-20-14(19)11-6-5-10(9-12(11)17)15-13(18)7-8-16(2)3/h5-6,9,15,17H,4,7-8H2,1-3H3
charge 0 multiplicity 1
40 atoms
O  -2.390023 -1.506693 -0.481956
O  4.640879 -1.113069 -0.096788
O  2.764831 2.677978 0.309062
O  4.869687 1.181229 0.215393
N  -6.438678 -0.227559 -0.156793
N  -1.579203 0.675778 -0.161301
C  -5.056902 -0.604123 0.217621
C  -4.006937 0.342759 -0.401428
C  -2.600291 -0.266972 -0.345922
C  -0.173913 0.48129 -0.121462
C  -7.3963 -1.323594 0.103568
C  -6.88626 1.042182 0.451486
C  0.627135 1.632348 0.068588
C  0.431606 -0.806249 -0.263088
C  2.655128 0.23451 -0.018581
C  2.032072 1.524581 0.121748
C  1.826827 -0.905471 -0.209603
C  4.116276 0.156899 0.043403
C  6.133644 -1.226278 -0.036492
C  6.465228 -2.7045 -0.204986
H  -4.916075 -0.644067 1.329426
H  -4.852142 -1.617361 -0.170445
H  -4.281324 0.485447 -1.465919
H  -4.02328 1.339568 0.079429
H  -1.8881 1.644792 -0.050411
H  -7.502368 -1.574871 1.189655
H  -8.393875 -1.041795 -0.278679
H  -7.071122 -2.234796 -0.428439
H  -6.234514 1.874499 0.133686
H  -7.910539 1.272463 0.108603
H  -6.894466 1.014537 1.57203
H  0.185561 2.62893 0.178526
H  -0.199744 -1.682712 -0.408308
H  2.30853 -1.881804 -0.315808
H  6.470391 -0.820366 0.934098
H  6.559141 -0.598801 -0.83991
H  3.754882 2.41695 0.322325
H  7.560732 -2.845296 -0.166071
H  6.009161 -3.306147 0.599482
H  6.101046 -3.083718 -1.174943
