program: Gaussian 09
title: 000016866
version: EM64L-G09RevD.01
frameworkgroup: C1[X(C3H3ClO2)]
method: RPBEPBE
basis: SDD
operation: Freq
keyword: #p
keyword: freq=noraman
keyword: PBEPBE/SDD
title: #p freq=noraman PBEPBE/SDD
converged: NO YES NO NO
title: Mulliken charges:
elementType: Cl O O C C C H H H
charge: 0.008406 -0.423126 -0.245453 -0.134401 0.192257 -0.359025 0.280424 0.297548 0.383370
chargesum: 0.00000
title: Mulliken charges with hydrogens summed into heavy atoms:
elementType: Cl O O C C C
charge: 0.008406 -0.039757 -0.245453 0.146024 0.192257 -0.061477
polarizability: 8.56104231e+01 1.88377279e+00 4.33510947e+01 2.59380124e-04 4.15509959e-05 1.91697238e+01
1716.lowfreq: -10.5008 -4.0127 -2.1403 0.0007 0.0029 0.0035 130.9033 148.8693 175.2636
frequency: 130.9015 148.8691 175.2581 304.5623 436.5359 575.7468 587.1029 682.6463 790.4736 838.3883 922.4572 952.4065 1057.4588 1195.6347 1252.7071 1325.4690 1619.0625 1638.7992 3186.8016 3192.1589 3524.4831
redmass: 2.7829 7.9652 4.6971 13.2552 5.1739 5.3292 1.2907 2.9707 7.1284 2.1634 4.6214 1.0873 2.0822 1.1979 1.2690 2.2806 7.5794 7.7095 1.0935 1.0960 1.0642
irintensity: 2.0791 1.0771 0.4699 0.0149 15.1785 65.1104 105.6918 81.8320 101.7797 0.0881 1.2909 83.7388 307.0973 18.8342 7.9698 54.6636 294.7704 185.6683 2.1597 1.0922 49.7686
temp: 298.150 k
press: 1.00000 atm
elementType: 17 8 8 6 6 6 1 1 1
symmnumber: 1
zpe: 146769.4 jmol-1
zpe.correction: 0.055902 hartree
zpe.thermalcorrener: 0.062127 hartree
zpe.thermalcorrenthalpy: 0.063071 hartree
zpe.thermalcorrgfe: 0.025081 hartree
zpe.sumelectzpe: -726.152663 hartree
zpe.sumelectthermal: -726.146437 hartree
zpe.sumelectthermalent: -726.145493 hartree
zpe.sumelectthermalfe: -726.183483 hartree
dipole: -0.4873 -0.9149 0.0001
dipole: 1.0365
quadrupole: -37.1961 -44.1384 -42.1173
quadrupole: 3.7417 0.0003 0.0004
quadrupole: 3.9545 -2.9878 -0.9667 3.7417 0.0003 0.0004
hfenergy: -726.208564 hartree
pointgroup: C01 [X(C3H3Cl1O2)]
dipole: 0.1963503 -0.3574224 -0.0001858 debye
dipolederiv: -0.8291892 -0.0371533 -0.000126 -0.2563307 -0.1174499 -0.0000733 -0.0002388 -0.000047 -0.033799 -0.9510846 0.5866736 0.0002464 0.5410301 -0.7560211 -0.0000913 0.0001751 -0.000022 -0.4385326 -0.7546866 -0.1801215 -0.0001485 -0.2102393 -0.9455487 -0.000309 -0.0001966 -0.0004191 -0.3366269 -1.0525159 -0.0005522 -0.0001324 0.0995502 -0.0497828 0.0000472 -0.0000477 0.0000448 -0.1314197 1.9158 -0.2519333 0.0001048 0.0428355 1.3809738 0.0005653 0.0002822 0.000569 0.2627823 1.3267919 0.0846451 0.0002328 0.0228183 0.2069464 0.0001779 0.00022 0.0001844 -0.1508092 0.0767143 -0.0214849 -0.000023 -0.0494059 0.0158296 -0.0000982 -0.0000246 -0.0000933 0.1951489 0.0096035 -0.0621239 -0.0000584 -0.039026 0.0369311 -0.0000961 -0.0000477 -0.0000972 0.2248391 0.2585667 -0.1179496 -0.0000958 -0.1512322 0.2281217 -0.0001225 -0.0001218 -0.0001195 0.408417 unknown
polarizability: 85.652109|-1.3361124|43.3094008|0.0089286|0.0125493|19.1697317 unknown
InChI: InChI=1S/C3H3ClO2/c4-2-1-3(5)6/h1-2,5H
charge 0 multiplicity 1
9 atoms
Cl -3.029066 -0.195914 -0.000402
O  2.0369 -0.997449 -0.000107
O  1.446056 1.25791 0.001024
C  -0.274588 -0.492203 -0.000206
C  1.103361 0.050363 0.000208
C  -1.324182 0.365086 0.000101
H  -0.393606 -1.57843 -0.00076
H  -1.220427 1.453104 0.000639
H  2.955753 -0.614767 0.000304
