program: Gaussian 09
title: 000202643
version: EM64L-G09RevD.01
frameworkgroup: C1[X(C15H20N2O5)]
method: RPBEPBE
basis: SDD
operation: Freq
keyword: #p
keyword: freq=noraman
keyword: PBEPBE/SDD
title: #p freq=noraman PBEPBE/SDD
converged: YES YES NO NO
title: Mulliken charges:
elementType: O O O O O N N C C C C C C C C C C C C C C C H H H H H H H H H H H H H H H H H H H H
charge: -0.245546 -0.243674 -0.413270 -0.273101 -0.339355 -0.092624 -0.463447 -0.328471 -0.347373 -0.335134 -0.323791 -0.318764 -0.572330 0.206456 0.555170 -0.609025 -0.367668 0.197199 0.090521 -0.321672 0.232168 -0.496363 0.203561 0.191352 0.193268 0.217575 0.260722 0.187571 0.214976 0.191839 0.194265 0.215697 0.260865 0.219662 0.313025 0.250788 0.311094 0.267663 0.388197 0.245686 0.245689 0.236598
chargesum: 0.00000
title: Mulliken charges with hydrogens summed into heavy atoms:
elementType: O O O O O N N C C C C C C C C C C C C C C C
charge: -0.245546 -0.243674 -0.025073 -0.273101 -0.339355 -0.092624 -0.150423 0.066443 0.063470 0.113159 0.083024 0.091198 -0.091802 0.206456 0.555170 -0.358237 -0.056574 0.197199 0.090521 -0.054009 0.232168 0.231610
polarizability: 3.39346435e+02 -1.94075669e+00 1.93367342e+02 -6.35543987e+00 4.14105647e-01 1.10490557e+02
1716.lowfreq: -13.8595 -2.7304 -0.0009 0.0006 0.0010 4.6639 11.1032 16.1082 32.0175
frequency: 7.4902 15.0020 32.0161 54.4841 68.1650 75.7610 80.8332 95.2008 101.9483 132.9634 155.2549 158.9722 170.5591 201.2872 236.9259 241.7990 259.5380 293.8173 307.9648 314.6260 330.7887 342.1829 388.6562 408.0024 446.6690 452.5843 455.8111 472.4602 515.5665 565.6987 576.0121 588.6760 616.1296 642.1073 673.8157 685.2315 700.3023 749.8676 762.2952 766.6795 773.3167 807.4097 818.8013 841.7680 854.4420 860.2520 874.6359 896.2564 900.9431 928.7539 974.6764 995.6373 999.4711 1027.0986 1038.5087 1053.6062 1057.1695 1071.1784 1087.9743 1104.5617 1114.5180 1132.0563 1138.3004 1143.2583 1151.8274 1167.9318 1189.7596 1196.4915 1207.3408 1233.0838 1239.9531 1266.3991 1284.8320 1289.5016 1296.3689 1306.2622 1323.7607 1331.4393 1345.4054 1350.5162 1364.6729 1372.4519 1387.6668 1390.8100 1421.8826 1440.6238 1442.4806 1444.1783 1450.2664 1451.6852 1451.8173 1458.4960 1463.2956 1479.9236 1493.8926 1495.0749 1568.9196 1586.0106 1627.8747 1656.8137 2855.4281 2858.3709 2875.0481 2953.9382 2959.1169 2980.8525 2992.6906 3008.7240 3029.1999 3031.6228 3036.5694 3055.5464 3081.1212 3085.0615 3112.5220 3144.7423 3153.7168 3168.4162 3209.4738 3524.5224
redmass: 3.9022 4.6708 5.5871 5.0081 4.8428 3.3919 1.1575 4.5327 3.8067 5.0412 5.4399 4.2467 4.3447 3.0088 2.0902 4.0808 4.4886 8.1134 2.4825 5.1763 4.4509 6.0411 2.1046 4.0650 6.6006 4.0167 3.0794 2.9688 5.1868 6.6391 3.7395 2.2029 3.0894 4.3096 1.9181 2.3961 4.6540 3.4313 5.3887 4.9950 2.0263 3.5661 2.3025 1.6149 1.4791 1.1676 1.5650 5.8694 2.4621 6.8003 3.7792 1.3110 2.7337 2.2102 1.9284 2.1739 2.9136 4.9361 3.6847 2.0887 1.2582 2.2647 2.3214 1.6583 1.5581 2.4424 1.0726 1.4402 1.4600 1.8443 1.2385 1.2997 2.2247 1.2593 1.3760 2.1494 1.6324 1.3073 1.3274 2.2002 1.4559 1.2667 3.3421 1.6581 1.8273 2.1026 1.1012 1.0820 1.0884 1.0935 1.0498 1.0959 1.0595 1.0916 2.0341 3.3997 4.9619 4.2719 4.4802 5.1454 1.0712 1.0702 1.0691 1.0667 1.0665 1.0586 1.0687 1.0295 1.0887 1.0916 1.0934 1.0945 1.0961 1.0978 1.1048 1.0922 1.1052 1.0907 1.0953 1.0763
irintensity: 0.0452 0.0632 0.6165 0.0386 10.6905 0.2560 1.6258 1.7776 1.0657 2.6067 0.9988 2.2838 2.6085 13.8850 2.3877 0.2758 6.3599 1.3237 17.5105 0.7409 1.7650 30.3599 2.4216 20.7416 1.9077 5.3120 4.6522 1.1480 10.0098 2.7468 2.5844 8.5732 8.6118 5.0550 63.1559 0.4527 9.4490 0.3699 7.8949 2.5391 1.2469 15.6788 18.8099 1.0632 19.0628 207.2008 13.9336 25.3958 8.8462 2.5142 11.5244 1.1920 47.5887 11.8839 11.8742 31.0901 7.3712 155.8324 66.7569 1.9617 0.0462 53.7439 67.3511 59.5132 136.7538 24.1983 4.4762 54.5949 87.2205 84.9487 44.4870 10.3325 398.9923 8.1779 23.3327 20.7097 16.2511 11.1119 19.1860 693.4809 69.5598 4.6796 3.2116 23.5156 272.6194 3.4747 7.9536 2.9688 2.8033 19.6377 14.9575 4.0046 13.6175 11.4780 254.7332 183.4396 50.3018 220.5787 139.6297 367.1320 31.6200 57.0293 163.2207 36.5601 100.9298 13.4823 343.3669 30.9857 47.4102 37.3964 4.8248 26.7218 39.8744 37.3333 23.7609 6.3199 13.7289 1.4838 7.1348 12.9519
temp: 298.150 k
press: 1.00000 atm
elementType: 8 8 8 8 8 7 7 6 6 6 6 6 6 6 6 6 6 6 6 6 6 6 1 1 1 1 1 1 1 1 1 1 1 1 1 1 1 1 1 1 1 1
symmnumber: 1
zpe: 887540.2 jmol-1
zpe.correction: 0.338046 hartree
zpe.thermalcorrener: 0.359502 hartree
zpe.thermalcorrenthalpy: 0.360446 hartree
zpe.thermalcorrgfe: 0.283775 hartree
zpe.sumelectzpe: -1067.554542 hartree
zpe.sumelectthermal: -1067.533086 hartree
zpe.sumelectthermalent: -1067.532142 hartree
zpe.sumelectthermalfe: -1067.608814 hartree
dipole: -0.9004 -0.0237 -0.0609
dipole: 0.9027
quadrupole: -132.9596 -128.5881 -132.0718
quadrupole: 17.3028 -2.3760 -1.4951
quadrupole: -1.7531 2.6184 -0.8653 17.3028 -2.3760 -1.4951
hfenergy: -1067.8925882 hartree
pointgroup: C01 [X(C15H20N2O5)]
dipole: 0.3541166 -0.0109275 0.0249272 debye
polarizability: 339.3358405|-1.2367731|191.4074506|-6.8729001|-12.5122074|112.4610424 unknown
InChI: InChI=1S/C15H20N2O5/c1-21-15(20)12-3-2-11(10-13(12)18)16-14(19)4-5-17-6-8-22-9-7-17/h2-3,10,16,18H,4-9H2,1H3
charge 0 multiplicity 1
42 atoms
O  -7.772389 0.388751 -0.230414
O  -0.953176 -1.594005 0.484979
O  4.35915 2.364438 -0.411651
O  6.087228 -1.474787 0.17532
O  6.409455 0.792312 -0.230935
N  -4.947421 -0.206705 0.145228
N  -0.059251 0.544942 0.098796
C  -5.393554 1.059807 -0.493457
C  -5.941535 -1.283488 -0.113451
C  -3.580159 -0.616434 -0.249477
C  -6.787389 1.450756 0.026522
C  -7.323291 -0.860561 0.408737
C  -2.498882 0.310307 0.345115
C  -1.114705 -0.351923 0.309488
C  1.338321 0.296163 0.07695
C  2.182825 1.408402 -0.151019
C  1.893875 -1.006213 0.275178
C  3.583247 1.246919 -0.185087
C  4.156233 -0.058321 0.014764
C  3.2848 -1.158838 0.241534
C  5.613491 -0.191085 -0.02614
C  7.561531 -1.635701 0.139267
H  -4.682401 1.86996 -0.246231
H  -5.430966 0.961247 -1.608771
H  -6.021414 -1.515892 -1.205385
H  -5.615696 -2.202637 0.408851
H  -3.393171 -1.630656 0.146132
H  -3.460464 -0.670119 -1.361733
H  -7.170912 2.342014 -0.497308
H  -6.730541 1.653221 1.118079
H  -7.277883 -0.721716 1.510407
H  -8.090685 -1.611839 0.159672
H  -2.765955 0.490112 1.40586
H  -2.478688 1.294685 -0.160695
H  -0.330032 1.520632 -0.047585
H  1.779823 2.415378 -0.305203
H  1.229161 -1.852601 0.44703
H  3.728854 -2.147088 0.391696
H  5.338951 2.071016 -0.404365
H  8.030641 -1.022363 0.92625
H  7.954021 -1.327849 -0.843978
H  7.726853 -2.70714 0.317136
