program: Gaussian 09
title: 000202559
version: EM64L-G09RevD.01
frameworkgroup: C1[X(C6H4Cl4)]
method: RPBEPBE
basis: SDD
operation: Freq
keyword: #pfreq=noraman
keyword: PBEPBE/SDD
title: #p freq=noraman PBEPBE/SDD
converged: NO YES NO NO
title: Mulliken charges:
elementType: Cl Cl Cl Cl C C C C C C H H H H
charge: -0.038740 0.013077 0.091047 0.057250 -0.080833 -0.118326 0.123190 -0.063022 -0.381112 -0.547064 0.251036 0.246804 0.225954 0.220740
chargesum: 0.00000
title: Mulliken charges with hydrogens summed into heavy atoms:
elementType: Cl Cl Cl Cl C C C C C C
charge: -0.038740 0.013077 0.091047 0.057250 -0.080833 0.132710 0.123190 0.183782 -0.381112 -0.100370
polarizability: 1.70145579e+02 2.26677393e+01 1.16343564e+02 7.65291445e+00 9.57841351e+00 6.81091294e+01
1716.lowfreq: -6.7487 -0.0043 -0.0038 -0.0023 3.9894 6.6243 29.7833 60.5978 78.0576
frequency: 29.7706 60.5929 78.0562 124.3387 153.2751 171.8780 183.5988 232.4009 264.7587 298.9393 336.0929 369.4555 377.0904 481.5591 562.9774 617.7957 636.7723 660.8345 747.6143 854.9121 899.1730 948.9490 965.4704 1012.6681 1132.4013 1189.1734 1261.5843 1287.1913 1429.9104 1574.6408 1621.3414 1642.8233 3098.5699 3112.6598 3136.1671 3210.8589
redmass: 11.1532 14.5390 8.3171 7.1026 2.4807 18.0036 8.3295 5.1078 5.7690 8.2099 5.4120 14.4688 5.7364 8.2362 9.3865 5.4795 6.9595 1.4185 10.8712 6.6697 1.6413 1.5280 1.3447 1.1412 9.8383 2.6436 1.2156 1.3041 1.2886 6.7699 5.6556 6.5159 1.0611 1.0903 1.0928 1.1144
irintensity: 0.3096 0.1251 0.1118 0.0730 0.1633 0.2095 2.3139 0.6395 2.0019 0.4157 1.3816 5.6194 0.9789 0.9029 17.3035 22.0305 86.7848 13.0194 123.5047 54.3723 7.1846 18.0084 85.9412 20.0718 81.1739 19.9724 18.0135 0.2872 12.3109 51.6057 21.6701 6.6160 4.6416 2.5718 7.7604 15.3634
temp: 298.150 k
press: 1.00000 atm
elementType: 17 17 17 17 6 6 6 6 6 6 1 1 1 1
symmnumber: 1
zpe: 207948.6 jmol-1
zpe.correction: 0.079203 hartree
zpe.thermalcorrener: 0.090728 hartree
zpe.thermalcorrenthalpy: 0.091673 hartree
zpe.thermalcorrgfe: 0.039216 hartree
zpe.sumelectzpe: -2070.463864 hartree
zpe.sumelectthermal: -2070.452339 hartree
zpe.sumelectthermalent: -2070.451395 hartree
zpe.sumelectthermalfe: -2070.503852 hartree
dipole: -1.8070 -1.7904 -1.0812
dipole: 2.7640
quadrupole: -77.9413 -86.4286 -85.7309
quadrupole: 3.5809 1.7572 2.6297
quadrupole: 5.4257 -3.0617 -2.3640 3.5809 1.7572 2.6297
hfenergy: -2070.5430674 hartree
pointgroup: C01 [X(C6H4Cl4)]
dipole: 0.8226786 0.6582312 -0.2692222 debye
dipolederiv: -0.2169758 0.1957206 -0.0903358 0.1191962 -0.5223555 0.2820785 -0.0869243 0.3674341 -0.2435127 -0.4143924 -0.244655 -0.1154537 -0.3428577 -0.4588535 -0.2270956 -0.2471245 -0.2924095 -0.1597453 -0.8569043 0.1387397 -0.1690353 0.152798 -0.0680013 -0.0599503 -0.2762286 -0.0418686 -0.0275805 -0.1913629 -0.1580012 -0.1704672 -0.0216053 -0.4363812 -0.3224276 -0.0543472 -0.3052132 -0.1920956 -0.1114034 -0.4673763 0.0677995 -0.1766121 0.6420389 -0.6506632 0.166108 -0.7196163 0.2791716 0.2687704 0.1248488 0.0042352 0.160809 -0.1605308 0.0686955 -0.0601273 0.0609374 -0.1187458 0.466369 0.540032 0.1020194 0.3993241 0.3289687 0.42371 0.292245 0.4447484 0.0912367 -0.0642924 0.0306595 -0.0208486 -0.2413889 0.0056192 -0.0680412 0.1290886 -0.025402 -0.0443575 1.1410735 -0.1051551 0.3728855 -0.2762366 0.5656623 0.39152 0.3135542 0.4071844 0.213602 -0.0829507 -0.0931665 0.1262832 0.0341894 -0.0711672 -0.2048371 0.011503 -0.214699 -0.1972032 0.0295965 -0.0146481 0.0004714 0.0840841 0.0074683 0.0905167 -0.0463218 0.061264 0.0760619 0.0522826 -0.0168982 -0.0060156 0.0662818 0.0345517 0.0996917 -0.0625932 0.0879596 0.094629 -0.0834198 0.0063593 -0.0381583 0.0135769 0.1076228 0.0513572 -0.0335849 0.0435528 0.1358365 0.0636099 0.0635405 -0.0633797 0.0284411 0.0253575 0.1254455 -0.045247 0.1261281 0.092703 unknown
polarizability: 175.584579|15.9136603|112.801071|1.8881484|-0.5995181|66.2126232 unknown
InChI: InChI=1S/C6H4Cl4/c1-2-3-4(7)5(8)6(9)10/h2-3H,1H2
charge 0 multiplicity 1
14 atoms
Cl 0.773405 -2.041435 1.186856
Cl -1.823767 -1.792148 -1.051531
Cl -3.511095 0.872342 -0.281096
Cl -1.141233 2.04173 1.158503
C  0.39062 -0.584662 0.134684
C  1.393496 0.227893 -0.317839
C  -1.033701 -0.40783 -0.152137
C  2.815463 0.101836 -0.030527
C  -1.793697 0.674319 0.180757
C  3.751327 0.966477 -0.523711
H  1.083343 1.062703 -0.96165
H  3.124188 -0.732489 0.611177
H  4.815098 0.849128 -0.292586
H  3.475753 1.810436 -1.168499
