program: Gaussian 09
title: 000202538
version: EM64L-G09RevD.01
frameworkgroup: C1[X(C7H10N2O2)]
method: RPBEPBE
basis: SDD
operation: Freq
keyword: #p
keyword: freq=noraman
keyword: PBEPBE/SDD
title: #p freq=noraman PBEPBE/SDD
converged: YES YES NO NO
title: Mulliken charges:
elementType: O O N N C C C C C C C H H H H H H H H H H
charge: -0.250219 -0.252648 -0.399191 -0.388867 0.151641 -0.504288 0.269023 0.123046 -0.788193 -0.681816 0.130946 0.197228 0.254132 0.344047 0.261089 0.247947 0.250588 0.222717 0.206451 0.245386 0.360981
chargesum: 0.00000
title: Mulliken charges with hydrogens summed into heavy atoms:
elementType: O O N N C C C C C C C
charge: -0.250219 -0.252648 -0.055144 -0.027886 0.151641 -0.052928 0.269023 0.123046 -0.028569 -0.007261 0.130946
polarizability: 1.22228674e+02 7.92503645e+00 1.09351062e+02 4.63231826e+00 9.04465886e-01 5.64932852e+01
1716.lowfreq: -9.1273 -5.1862 -0.0007 -0.0005 0.0005 12.6411 50.6366 75.6719 79.7246
frequency: 49.8670 75.5171 79.6757 157.1136 177.1548 192.5950 216.0403 305.7616 338.7799 361.5258 401.3091 481.6741 503.1445 548.7542 591.8707 595.2130 625.2306 702.4584 728.5610 746.9616 777.8089 782.6730 943.9287 948.2419 981.9880 1037.2503 1043.6258 1067.0836 1124.8636 1170.7177 1220.6880 1252.3041 1291.7888 1327.1468 1353.5139 1384.2837 1390.9619 1404.0247 1450.1477 1459.8101 1472.1572 1472.9216 1483.0003 1490.4537 1610.1456 1648.7962 1679.9282 2980.6444 2982.4819 3005.1518 3054.5400 3056.8520 3078.3946 3091.7504 3133.9184 3531.2802 3552.7436
redmass: 2.0978 1.1564 5.0245 5.8226 3.6370 4.5270 1.0883 3.2763 2.2211 9.1634 5.8150 4.5771 6.1514 3.5775 4.1183 5.8769 1.2211 2.1380 4.2324 2.8158 1.2597 2.8868 2.9269 2.0568 2.5776 1.6858 1.5434 1.9688 2.1576 4.7695 4.3609 1.5522 1.8825 1.4724 1.8445 1.7008 1.5614 1.2579 1.9170 1.2501 1.0782 1.0463 1.0764 1.1209 6.8162 6.5019 5.4453 1.0356 1.0403 1.0613 1.0979 1.0997 1.1000 1.1012 1.0948 1.0771 1.0778
irintensity: 0.8852 0.1347 0.0201 1.2044 2.0673 1.8070 0.3454 1.1357 3.6516 17.4460 7.3786 5.7384 10.1731 1.5970 1.4694 1.0278 73.3840 5.5098 16.7575 57.9101 11.6333 100.7894 1.5102 10.3908 5.8506 5.1564 3.7446 15.0793 11.1888 24.8384 10.7583 16.3432 33.0311 10.9303 26.8366 53.7841 36.3554 44.1012 70.0707 15.8706 13.6067 15.2648 1.2922 18.3561 173.8541 249.6520 717.6067 33.4690 20.6790 30.8399 11.6488 2.7815 47.2719 30.6318 9.4936 56.3408 63.5636
temp: 298.150 k
press: 1.00000 atm
elementType: 8 8 7 7 6 6 6 6 6 6 6 1 1 1 1 1 1 1 1 1 1
symmnumber: 1
zpe: 440328.8 jmol-1
zpe.correction: 0.167712 hartree
zpe.thermalcorrener: 0.178705 hartree
zpe.thermalcorrenthalpy: 0.179650 hartree
zpe.thermalcorrgfe: 0.130579 hartree
zpe.sumelectzpe: -531.914143 hartree
zpe.sumelectthermal: -531.903150 hartree
zpe.sumelectthermalent: -531.902205 hartree
zpe.sumelectthermalfe: -531.951276 hartree
dipole: -2.2229 4.9027 -0.1415
dipole: 5.3850
quadrupole: -76.3356 -62.6200 -65.8247
quadrupole: -3.7190 -1.2829 -1.3942
quadrupole: -8.0755 5.6401 2.4354 -3.7190 -1.2829 -1.3942
hfenergy: -532.081855 hartree
pointgroup: C01 [X(C7H10N2O2)]
dipole: -0.8325047 1.9475569 -0.0498202 debye
dipolederiv: -0.6651364 -0.1850673 -0.0309781 -0.3305833 -1.1502813 -0.067922 -0.0361113 -0.0330504 -0.3669218 -1.5070421 0.0143105 -0.1197405 0.0338366 -0.4867645 -0.0002556 -0.1477254 0.001384 -0.4094899 -1.221884 -0.131184 -0.0819498 0.6143099 -0.613265 0.0653682 -0.1205812 -0.021471 -0.3074998 -1.1418553 -0.2968896 -0.0980825 -0.365855 -0.5252 -0.0529569 -0.1071434 -0.0429364 -0.3504179 -0.0002635 0.1251268 -0.0041847 -0.141798 -0.8909183 -0.0183226 0.0092514 0.0105961 -0.1468072 0.0692861 -0.017828 0.0203912 0.0121958 0.086132 -0.0379108 0.108513 -0.0246962 0.0893131 0.9066508 0.4446481 0.1070003 0.0337879 0.6789695 0.0075567 0.1199107 0.0782113 0.0374917 1.1861 0.0373141 0.1099693 0.3180166 1.4723947 0.0685575 0.1065324 0.008241 0.257518 -0.0519441 0.0048717 -0.0249067 0.1117229 -0.1689054 0.0070845 -0.0190354 -0.019764 0.076602 -0.0069796 0.0051394 0.0322047 0.0145475 0.0875198 0.0196847 -0.0468618 0.0111126 -0.0012803 2.0465346 0.0341451 0.1999736 -0.2500193 1.0445839 -0.0047408 0.2219251 0.0073318 0.3362709 -0.0114893 0.0293661 -0.0107525 0.0827903 -0.0562663 0.1475387 -0.0173966 0.0947502 -0.0202312 0.069535 -0.0043622 0.0046612 -0.0817007 -0.0000058 -0.1056967 0.0012436 -0.0569017 0.0212654 0.1817342 0.0167416 -0.018248 0.0396724 0.2112982 0.0014898 -0.0173497 0.0026399 0.3209726 -0.0834749 0.0460308 -0.0254493 -0.0217046 0.1190105 -0.0105343 -0.031562 0.0087697 0.1030695 0.0524575 -0.0557832 0.0883069 -0.0284741 -0.0021713 0.0628191 0.0742125 0.1105539 0.0012812 0.0930535 -0.0124969 -0.0559636 -0.0068317 0.0102009 -0.0549421 -0.046531 -0.1114459 -0.0422356 -0.2419236 -0.0240551 -0.0008043 -0.01205 0.1040811 -0.0047125 -0.0034152 0.001448 0.0655101 0.0734083 -0.0698 -0.024782 -0.01946 -0.089837 -0.1312137 0.0032078 -0.0831557 -0.0071032 0.099146 0.0750175 -0.0430601 0.026779 -0.0386695 0.1117906 -0.0272728 0.0619196 0.0082925 0.1540867 -0.0352454 -0.0236051 -0.0291822 0.2080938 -0.0026818 -0.0238109 -0.0035369 0.3343999 unknown
polarizability: 122.6477019|7.6449695|109.0106969|4.0563506|0.6929938|56.414622 unknown
InChI: InChI=1S/C7H10N2O2/c1-3-5-4(2)8-7(11)9-6(5)10/h8-9H,3H2,1-2H3
charge 0 multiplicity 1
21 atoms
O  -0.699198 -2.399898 -0.248028
O  3.305657 -0.039794 0.294293
N  1.297317 1.140503 0.036415
N  1.274135 -1.194707 0.016065
C  -0.83216 0.032366 -0.265066
C  -2.337064 -0.021319 -0.444274
C  -0.094778 1.197909 -0.148602
C  -0.137627 -1.266672 -0.172499
C  -0.655295 2.600628 -0.195174
C  -3.10035 -0.044155 0.907059
C  2.056037 -0.039566 0.127448
H  -2.690375 0.823903 -1.063194
H  -2.5750 -0.949499 -0.994025
H  1.838639 2.003754 0.11642
H  -1.742654 2.593555 -0.349162
H  -0.195501 3.183158 -1.016203
H  -0.45121 3.13625 0.751608
H  -4.190359 -0.11292 0.737915
H  -2.900348 0.867355 1.500562
H  -2.792995 -0.918813 1.506539
H  1.77253 -2.087837 0.0777
