program: Gaussian 09
title: 000016865
version: EM64L-G09RevD.01
frameworkgroup: C1[X(C9H8O4)]
method: RPBEPBE
basis: SDD
operation: Freq
keyword: #p
keyword: freq=noraman
keyword: PBEPBE/SDD
title: #p freq=noraman PBEPBE/SDD
converged: NO YES NO NO
title: Mulliken charges:
elementType: O O O O C C C C C C C C C H H H H H H H H
charge: -0.280161 -0.441036 -0.251599 -0.217618 0.369934 0.254096 -0.382798 -0.306793 -0.325001 -0.313668 0.112938 0.262379 -0.746780 0.261874 0.305984 0.275806 0.277126 0.255250 0.249373 0.255270 0.385425
chargesum: 0.00000
title: Mulliken charges with hydrogens summed into heavy atoms:
elementType: O O O O C C C C C C C C C
charge: -0.280161 -0.055611 -0.251599 -0.217618 0.369934 0.254096 -0.120924 -0.000808 -0.049195 -0.036542 0.112938 0.262379 0.013112
polarizability: 1.86581047e+02 -1.38704967e+00 1.11457229e+02 5.70262364e-02 -1.51912718e-01 4.88540786e+01
1716.lowfreq: -5.7945 -0.0011 -0.0010 -0.0009 1.9950 7.0211 33.2884 53.4309 74.5104
frequency: 33.2688 53.4086 74.4960 75.5991 120.3224 137.0007 205.4747 264.0306 302.0156 329.9590 406.3394 412.9120 486.0636 498.4187 540.5207 554.0641 589.8976 615.8577 634.6565 685.9746 701.7069 758.1672 773.9041 852.2738 875.9844 882.1911 989.6781 991.0603 998.8587 1000.2599 1021.7052 1040.7233 1115.5638 1146.1710 1156.5057 1173.3706 1201.7921 1297.4132 1322.3055 1381.4217 1385.6474 1417.8658 1451.3683 1453.0877 1487.6797 1577.8542 1614.6967 1643.1374 1667.3403 3009.1395 3096.9224 3146.8184 3157.4558 3174.0245 3178.2524 3216.0661 3532.0235
redmass: 7.1266 3.5159 1.8153 2.0621 5.9503 6.0121 6.6702 5.5657 5.8778 5.6065 4.9716 2.9699 6.2785 2.8424 4.9053 3.1121 1.2331 6.2373 5.1661 3.6999 6.3584 4.4100 6.3675 1.2721 1.6193 7.0078 1.3505 2.0622 4.5051 1.3461 2.5683 1.6430 1.3045 2.1191 1.9326 2.9338 1.6290 1.3291 2.6290 4.1632 1.3943 3.8535 1.0590 1.0465 2.5983 7.8513 6.4242 8.6378 9.7823 1.0370 1.0972 1.1010 1.0887 1.0918 1.0969 1.0948 1.0642
irintensity: 4.1401 2.0280 0.1190 0.2239 3.0488 0.8090 0.6927 0.8457 5.6067 2.2846 21.0861 0.1676 10.3794 37.4633 6.0773 0.0631 80.9338 19.0393 39.8195 73.1794 2.3882 24.0244 3.0108 4.2404 71.8149 86.6473 0.0967 206.5380 146.4117 0.6857 123.5628 9.7163 20.0506 464.4134 127.2304 254.7795 78.4381 6.3196 125.3574 10.2943 50.3861 35.2507 23.9883 19.4397 70.5286 48.8951 69.2193 350.1281 156.4266 0.6425 5.6162 9.9026 0.3062 1.3882 2.7522 2.7313 49.7328
temp: 298.150 k
press: 1.00000 atm
elementType: 8 8 8 8 6 6 6 6 6 6 6 6 6 1 1 1 1 1 1 1 1
symmnumber: 1
zpe: 400215.0 jmol-1
zpe.correction: 0.152434 hartree
zpe.thermalcorrener: 0.164595 hartree
zpe.thermalcorrenthalpy: 0.165539 hartree
zpe.thermalcorrgfe: 0.112449 hartree
zpe.sumelectzpe: -647.732390 hartree
zpe.sumelectthermal: -647.720229 hartree
zpe.sumelectthermalent: -647.719285 hartree
zpe.sumelectthermalfe: -647.772375 hartree
dipole: -2.2158 -0.5971 -0.0165
dipole: 2.2949
quadrupole: -65.1658 -75.2251 -75.8693
quadrupole: 15.5251 -0.0199 -0.1223
quadrupole: 6.9209 -3.1383 -3.7826 15.5251 -0.0199 -0.1223
hfenergy: -647.8848237 hartree
pointgroup: C01 [X(C9H8O4)]
dipole: 0.8827638 0.1761105 -0.069944 debye
dipolederiv: -2.4187871 0.4095018 -0.1378224 0.6624574 -0.5670459 0.1333029 -0.2285999 0.1354699 -0.2349167 -0.7129372 -0.4045451 0.1364559 -0.6159865 -0.9453014 0.1760316 0.2079097 0.1753686 -0.4881605 -1.0998525 0.2837593 -0.0896413 0.2564577 -0.7523364 0.1372933 -0.0792172 0.1363925 -0.3806215 -0.660569 -0.1063068 0.0387117 0.5226213 -0.8831975 0.2091963 -0.1870312 0.209538 -0.3641317 1.5764423 -0.1453975 0.0434164 0.1431387 0.2011848 -0.0271383 -0.0612301 -0.0270553 0.1203938 -0.9045296 -0.0000563 0.0053073 -0.0397687 -0.0873166 0.026482 0.020465 0.0267677 -0.0161759 -0.4545482 0.1573772 -0.0531092 0.244755 -0.0358397 -0.0472643 -0.0805965 -0.0467342 -0.1552734 -0.4681653 -0.0897204 0.0309524 -0.2596282 -0.1167495 -0.0111482 0.0894314 -0.0134599 -0.1504623 0.2624919 -0.0826533 0.0251095 0.1603217 0.0339555 -0.0477847 -0.0574503 -0.0461749 -0.0921717 0.2670599 0.0720241 -0.0269869 -0.1227695 0.0497395 -0.0501654 0.0388199 -0.0525956 -0.0877444 2.1893756 0.0494633 -0.0291619 0.2324519 1.2816437 -0.3494728 -0.0926705 -0.3481113 0.3540719 2.1478575 -0.1474782 0.0537823 -1.1600945 1.2817958 -0.3755821 0.4203278 -0.3768737 0.3502238 -0.411064 -0.1298833 0.0416389 -0.2478059 -0.0979365 0.0384181 0.0693904 0.0343187 0.0032281 0.0571147 -0.0678615 0.0238175 -0.0717791 0.020125 0.0511015 0.0253595 0.0512495 0.155501 0.1380248 0.0421486 -0.0130059 0.0324839 0.0784256 0.0341925 -0.0097971 0.0354267 0.1710943 0.0786019 0.0716275 -0.0232554 0.0394482 0.0389969 0.0390554 -0.0122076 0.0389621 0.1449423 0.0904807 -0.0411607 0.0139631 -0.047831 0.0292655 0.0428147 0.0161234 0.042975 0.1429976 0.0856186 -0.0026097 -0.022864 0.0133009 0.1212237 0.0559016 0.0147815 0.0573321 -0.0446596 -0.0280666 0.0552432 -0.0140655 0.1028639 0.0199056 0.0327718 -0.0256996 0.035493 0.1211847 0.0837952 0.0063177 0.0185123 -0.0020726 0.0174449 -0.0968384 -0.0170219 -0.0975881 0.0585834 0.1816563 0.0702099 -0.0217549 0.1574352 0.3120172 0.0288325 -0.0510868 0.0292993 0.3920966 unknown
polarizability: 186.231358|-5.1837915|105.44167|1.1579675|-18.9757569|55.2193262 unknown
InChI: InChI=1S/C9H8O4/c1-6(10)13-8-4-2-7(3-5-8)9(11)12/h2-5,11H,1H3
charge 0 multiplicity 1
21 atoms
O  2.393525 0.393959 -0.2286
O  -3.829152 -1.196158 0.350995
O  -4.057818 0.997754 -0.377858
O  3.168733 -1.706867 0.519019
C  0.988425 0.175315 -0.143478
C  -1.822771 0.058183 -0.082134
C  0.231625 1.313903 -0.515521
C  0.359184 -1.027897 0.261381
C  -1.169711 1.254512 -0.484492
C  -1.0503 -1.070946 0.286842
C  -3.306568 0.0412 -0.065477
C  3.396091 -0.552721 0.110573
C  4.749774 0.080924 -0.111135
H  0.760103 2.220992 -0.821911
H  0.951955 -1.896153 0.54797
H  -1.777897 2.119746 -0.766307
H  -1.560515 -1.987536 0.595326
H  4.83882 0.43932 -1.150908
H  5.539171 -0.653482 0.101949
H  4.869293 0.957664 0.549273
H  -4.822064 -1.140212 0.339392
