program: Gaussian 09
title: 000202618
version: EM64L-G09RevD.01
frameworkgroup: C1[X(C6H12N6O9S3)]
method: RPBEPBE
basis: SDD
operation: Freq
keyword: #p
keyword: freq=noraman
keyword: PBEPBE/SDD
title: #p freq=noraman PBEPBE/SDD
converged: YES YES NO NO
title: Mulliken charges:
elementType: S S S O O O O O O O O O N N N N N N C C C C C C H H H H H H H H H H H H
charge: 1.012008 1.062757 1.038618 -0.608370 -0.563100 -0.596031 -0.515174 -0.505166 -0.514714 -0.564795 -0.524229 -0.629946 -0.236013 -0.259631 -0.245775 -0.096906 -0.081132 -0.097734 -0.566891 -0.569689 -0.542064 0.124551 0.144245 0.142511 0.321157 0.305388 0.296062 0.323697 0.379463 0.310098 0.373632 0.360663 0.360384 0.378336 0.402148 0.381643
chargesum: 0.00000
title: Mulliken charges with hydrogens summed into heavy atoms:
elementType: S S S O O O O O O O O O N N N N N N C C C C C C
charge: 1.012008 1.062757 1.038618 -0.230034 -0.160952 -0.214388 -0.515174 -0.505166 -0.514714 -0.564795 -0.524229 -0.629946 0.137619 0.101032 0.114609 -0.096906 -0.081132 -0.097734 0.059653 0.050070 0.147498 0.124551 0.144245 0.142511
polarizability: 3.81360445e+02 8.04044788e-01 2.41289351e+02 -3.77838934e+00 -8.45635964e+00 1.70653713e+02
1716.lowfreq: -9.6167 -3.6683 0.0011 0.0016 0.0020 1.3376 18.2728 22.1467 26.1182
frequency: 18.2649 22.0842 26.1022 34.4642 44.8785 54.5425 64.0016 81.9718 96.5049 104.4082 113.1461 117.6459 126.8480 135.6655 140.2076 164.4197 176.6935 180.5046 190.4156 201.8244 210.0142 223.1730 235.5672 247.7000 256.3471 283.9362 285.1513 294.6619 299.1164 300.5949 314.4401 338.9887 368.4692 387.1387 407.8403 423.6052 443.3964 461.3443 478.7494 512.2308 525.2851 529.0325 538.1330 563.8994 582.6943 634.4338 639.5302 646.7458 686.2326 692.3742 695.1169 723.5179 753.2645 805.2651 809.0437 833.6555 836.9767 881.0348 908.6203 914.1732 918.6093 937.2020 960.8713 965.8959 983.2557 1012.7261 1019.9787 1036.6498 1135.1016 1154.5670 1175.7781 1187.0654 1201.4006 1206.8311 1218.7717 1255.7199 1267.2302 1287.2938 1304.5419 1323.5147 1380.2655 1397.7404 1423.2826 1429.0691 1460.5375 1473.4041 1478.0863 1522.2401 1539.3341 1574.3319 2993.0938 3018.2084 3072.2714 3109.0577 3186.1472 3191.5109 3223.2830 3497.1346 3511.0552 3527.2570 3546.0297 3553.7923
redmass: 13.8165 8.7954 10.7973 9.9924 11.0730 10.3810 9.0581 8.5625 11.2808 12.1440 8.3265 8.3121 10.1080 10.9967 9.2514 7.0375 3.3159 5.5574 3.4461 2.3134 2.9976 5.0815 3.1865 5.7135 6.0773 7.8971 8.4792 6.6603 2.4656 2.8703 10.8834 3.3543 4.1231 6.4305 9.0783 8.9182 5.9652 4.9349 4.8770 4.7494 6.2072 12.4267 7.4115 9.5898 4.3304 1.8124 1.4419 2.3788 1.3676 1.8924 2.5027 5.6089 2.1897 10.1437 8.9692 13.8954 9.3415 2.1889 5.9524 2.7364 2.5806 3.3320 11.3298 3.3414 1.7684 1.5852 1.1789 2.2042 1.3843 1.5738 1.4169 1.4710 1.2979 1.4734 1.3056 2.2838 5.1240 1.5502 1.6172 1.9452 2.6538 1.5847 1.3743 1.3445 1.4111 4.0471 2.0085 3.5798 2.6528 3.8481 1.0706 1.0698 1.0574 1.0552 1.1168 1.1108 1.1192 1.0664 1.0667 1.0772 1.0787 1.0782
irintensity: 0.8245 1.8058 0.3528 0.4941 3.1050 3.6392 2.0979 5.7034 0.4476 10.7885 2.8885 0.6413 4.6780 2.3519 13.7872 43.0718 5.7346 17.6927 46.8939 60.9045 65.4032 14.7080 3.0280 70.4098 30.5511 25.3136 4.4225 3.1437 85.2532 63.6438 6.3949 3.9102 2.5708 48.9843 40.8938 1.0355 110.6108 5.1855 31.3418 21.6049 22.4394 224.0336 90.3608 123.3407 0.8917 62.1896 27.2791 3.1241 25.6232 179.7109 57.3677 4.1549 52.9837 50.3168 54.3752 63.0095 41.2114 7.4717 8.1774 33.2372 31.0376 134.8849 91.8006 40.4728 62.7862 80.3854 52.6523 14.9921 46.3165 35.8737 331.5510 99.0172 26.4632 268.4099 134.7841 55.5866 3.4143 91.7328 33.4763 9.8862 333.5074 208.1784 26.1693 102.2144 296.6978 549.1924 82.0971 1320.9888 359.0229 233.6630 1.8970 573.7339 35.9334 8.5254 9.0051 16.4805 3.9435 77.4124 48.3537 86.5249 100.6749 80.8606
temp: 298.150 k
press: 1.00000 atm
elementType: 16 16 16 8 8 8 8 8 8 8 8 8 7 7 7 7 7 7 6 6 6 6 6 6 1 1 1 1 1 1 1 1 1 1 1 1
symmnumber: 1
zpe: 596495.3 jmol-1
zpe.correction: 0.227193 hartree
zpe.thermalcorrener: 0.255297 hartree
zpe.thermalcorrenthalpy: 0.256241 hartree
zpe.thermalcorrgfe: 0.165879 hartree
zpe.sumelectzpe: -2433.224584 hartree
zpe.sumelectthermal: -2433.196481 hartree
zpe.sumelectthermalent: -2433.195537 hartree
zpe.sumelectthermalfe: -2433.285898 hartree
dipole: 2.9274 -7.8842 -2.8923
dipole: 8.8936
quadrupole: -182.4149 -178.0591 -159.5751
quadrupole: -0.5714 -4.4738 -23.7628
quadrupole: -9.0652 -4.7094 13.7746 -0.5714 -4.4738 -23.7628
hfenergy: -2433.4517775 hartree
pointgroup: C01 [X(C6H12N6O9S3)]
dipole: 0.9588489 2.9859821 1.5516591 debye
polarizability: 380.9398231|7.598787|242.6656057|3.9949318|1.6293214|169.6980789 unknown
InChI: InChI=1S/C6H11N6O6S2.HO3S/c1-7-4-10-5(8-2-19(13,14)15)12-6(11-4)9-3-20(16,17)18;1-4(2)3/h7-9,13,16H,1-3H2;1H
charge 0 multiplicity 1
36 atoms
S  5.0672 -0.351049 -0.457056
S  -2.407299 -2.906899 -0.896546
S  -3.795096 1.067215 0.288461
O  5.673416 1.425738 -0.767632
O  -4.166226 -2.948058 -0.393377
O  -5.232162 1.925858 -0.543337
O  4.022107 -0.728918 -1.637221
O  6.332145 -1.315133 -0.158716
O  -2.017319 -4.412911 -1.316466
O  -2.176139 -1.703015 -1.971828
O  -3.314131 1.918354 1.57679
O  -4.284176 -0.468848 0.605571
N  3.040898 1.226857 0.793776
N  -0.284258 -2.128854 1.035883
N  -1.285093 1.965435 -0.925073
N  1.443218 -0.513835 0.913783
N  0.906432 1.669826 -0.050899
N  -0.81148 -0.025483 0.175868
C  4.0792 0.415716 1.236937
C  -1.644654 -2.49381 1.000954
C  -2.441535 1.395415 -1.416529
C  1.750166 0.765003 0.544354
C  0.137017 -0.852747 0.700287
C  -0.352863 1.183641 -0.224103
H  4.93144 0.948833 1.671337
H  3.755564 -0.502616 1.738825
H  -1.849807 -3.462799 1.473988
H  -2.339993 -1.687499 1.271109
H  -2.384065 0.328177 -1.692427
H  -3.09034 2.05677 -2.001906
H  3.255177 2.158306 0.423083
H  0.443219 -2.817017 1.243323
H  -1.114169 2.973275 -0.969009
H  6.16921 1.44854 -1.634215
H  -4.399281 -1.984542 -0.127078
H  -6.052518 1.805178 0.015987
