program: Gaussian 09
title: 000202608
version: EM64L-G09RevD.01
frameworkgroup: C1[X(C21H13N5O7)]
method: RPBEPBE
basis: SDD
operation: Freq
keyword: #p
keyword: freq=noraman
keyword: PBEPBE/SDD
title: #p freq=noraman PBEPBE/SDD
converged: YES YES NO NO
title: Mulliken charges:
elementType: O O O O O O O N N N N N C C C C C C C C C C C C C C C C C C C C C H H H H H H H H H H H H H
charge: -0.226857 -0.181482 -0.221288 -0.215012 -0.197814 -0.211797 -0.196726 -0.059768 -0.398668 0.100218 0.048873 0.051032 0.243022 0.196139 -0.097466 0.218968 -0.446965 -0.382322 -0.319873 0.123739 -0.251710 -0.303327 -0.223987 -0.322934 0.400014 -0.360393 0.268010 -0.306589 0.382160 -0.369516 -0.305676 0.276568 -0.297725 0.273121 0.266922 0.269157 0.239567 0.274804 0.242424 0.290220 0.321604 0.272996 0.295224 0.248067 0.297763 0.297285
chargesum: 0.00000
title: Mulliken charges with hydrogens summed into heavy atoms:
elementType: O O O O O O O N N N N N C C C C C C C C C C C C C C C C C C C C C
charge: -0.226857 -0.181482 -0.221288 -0.215012 -0.197814 -0.211797 -0.196726 -0.059768 -0.077064 0.100218 0.048873 0.051032 0.243022 0.196139 -0.097466 0.218968 -0.173844 -0.115400 -0.050716 0.123739 -0.012142 -0.028523 0.018437 -0.032714 0.400014 -0.087397 0.268010 -0.011365 0.382160 -0.121449 -0.007913 0.276568 -0.000439
polarizability: 8.14806258e+02 6.37389700e+01 3.83460237e+02 4.47821068e-01 -3.93011996e+01 1.71346230e+02
1716.lowfreq: -2.3129 -0.9767 -0.0013 -0.0009 -0.0007 3.9456 10.4010 18.4595 21.8470
frequency: 10.3891 18.4522 21.8430 28.8561 34.5850 38.7839 52.7526 68.6810 73.7806 74.6564 101.3538 108.0883 114.7505 137.3737 150.2077 159.8875 172.8697 177.6872 203.5256 216.1488 225.6114 252.0757 258.2395 269.3331 308.9056 338.0775 354.5182 360.5023 367.8917 397.5670 405.2101 419.9700 442.3729 470.6301 491.0847 510.0997 527.3335 528.3684 539.6806 556.1129 562.8812 563.1776 619.5488 641.6816 648.4824 649.6036 662.7873 678.1259 681.3749 692.7103 712.3410 729.8545 733.8110 742.9169 756.6328 783.2318 789.1570 790.8704 798.1232 810.7029 828.7709 883.4146 886.1297 891.8739 905.4307 907.8880 913.4634 918.5897 922.7014 926.9728 933.7421 942.2421 973.9674 979.4754 990.3032 1001.4393 1002.7448 1019.5299 1025.6551 1028.3271 1066.0601 1124.0432 1130.8694 1134.2754 1152.1282 1171.4451 1171.6335 1177.0612 1189.5893 1219.3719 1221.0305 1236.2542 1254.7809 1260.8039 1287.3331 1288.6957 1296.9738 1321.6708 1335.8029 1345.0241 1345.4897 1350.8311 1371.9684 1373.8064 1383.5811 1410.0031 1450.7811 1471.2090 1486.1465 1499.2727 1512.5829 1529.4845 1544.7598 1549.0488 1577.0814 1587.0141 1614.4874 1627.5483 1639.6421 3024.7590 3134.3079 3135.9150 3145.3024 3146.9529 3157.6172 3161.1761 3176.1147 3230.7102 3241.7594 3259.6074 3260.6802 3369.0312
redmass: 11.5618 7.9418 6.7155 7.1177 8.6067 8.1381 10.4741 9.1611 7.4097 6.9411 8.6270 6.2026 6.6715 8.6590 7.3732 8.1714 4.5538 5.7851 7.7005 5.3193 5.6606 5.8155 4.0568 6.2792 3.0236 8.5238 5.1092 5.5760 6.3686 7.3296 7.9713 6.2193 4.1945 7.9658 6.6024 5.9658 8.0140 3.9532 4.7566 7.9045 5.3647 5.8307 5.2823 4.5504 2.8230 3.8850 1.7063 8.5471 8.4262 3.7876 7.1922 9.0722 12.4956 7.2878 4.8874 1.6120 4.6981 4.3478 3.5842 1.3310 1.3011 5.9600 1.5337 1.7578 1.4182 8.8517 1.3758 8.0039 6.3304 1.5035 1.9458 3.8705 1.3871 4.6521 1.1055 2.1808 2.0745 1.2831 1.3765 1.8119 6.7166 2.1670 3.8259 4.7789 2.6313 1.7517 2.2410 1.5937 1.5105 2.6963 1.9994 1.8753 1.7294 5.3360 4.3751 2.3717 2.4112 3.2448 2.4317 9.3813 6.3495 3.0581 3.6505 3.9291 4.3692 3.1854 3.0462 2.7262 6.1254 4.7361 3.0043 6.3801 6.1293 6.1165 7.1476 5.9892 6.0443 7.4961 6.3296 1.0886 1.0861 1.0950 1.0873 1.0898 1.0926 1.0951 1.0999 1.0961 1.0954 1.1031 1.1045 1.0762
irintensity: 0.3099 1.6149 2.8069 1.1379 0.6832 1.8597 4.5032 1.7035 2.8583 5.9938 2.1461 2.0447 2.9689 0.0509 1.0094 3.6591 3.4614 2.2246 4.8098 4.2376 6.1691 3.3203 16.9239 4.2665 0.0838 0.6893 2.0074 4.3974 10.6708 6.1650 1.5253 0.4668 6.9613 2.7507 4.3486 3.3394 11.9230 4.1081 3.4354 0.1763 1.1458 0.8622 12.4508 15.9594 22.5633 3.7840 60.2386 9.5069 16.7946 1.1482 5.7923 17.1696 18.0952 31.2508 5.5855 61.0212 3.4577 54.0196 9.0779 55.6475 56.8261 11.5572 0.1131 6.0693 2.1866 14.5462 4.3013 9.1355 0.1177 30.2011 9.9755 14.5829 0.7488 3.3050 65.6116 1.3165 0.6969 55.2676 14.7105 28.4277 1.2781 55.8677 248.4624 119.1566 338.5895 49.2929 188.9835 191.7029 49.4636 825.2518 134.0085 201.5846 16.8454 287.9573 118.4194 51.3369 2.3859 25.1946 8.3086 179.7929 62.5299 18.3761 13.3455 26.1477 6.1225 19.0888 12.4144 643.8473 224.4544 90.2886 88.7372 54.1788 30.5556 46.4642 56.9698 15.4160 4.4981 159.1316 7.5251 28.6157 3.5054 3.7874 3.2980 11.5802 0.8818 19.9440 22.6099 0.9603 0.2509 5.6302 7.2912 0.7735
temp: 298.150 k
press: 1.00000 atm
elementType: 8 8 8 8 8 8 8 7 7 7 7 7 6 6 6 6 6 6 6 6 6 6 6 6 6 6 6 6 6 6 6 6 6 1 1 1 1 1 1 1 1 1 1 1 1 1
symmnumber: 1
zpe: 819875.3 jmol-1
zpe.correction: 0.312274 hartree
zpe.thermalcorrener: 0.340112 hartree
zpe.thermalcorrenthalpy: 0.341056 hartree
zpe.thermalcorrgfe: 0.248362 hartree
zpe.sumelectzpe: -1605.819108 hartree
zpe.sumelectthermal: -1605.791270 hartree
zpe.sumelectthermalent: -1605.790326 hartree
zpe.sumelectthermalfe: -1605.883021 hartree
dipole: -2.0175 8.5094 -0.8641
dipole: 8.7879
quadrupole: -270.0737 -187.5826 -197.0159
quadrupole: -34.8639 32.6585 -3.0344
quadrupole: -51.8496 30.6414 21.2082 -34.8639 32.6585 -3.0344
hfenergy: -1606.1313825 hartree
pointgroup: C01 [X(C21H13N5O7)]
dipole: 0.9866704 3.1627499 0.9886121 debye
polarizability: 806.0025155|-86.7644364|368.1331824|-15.8202273|79.3578847|195.4770281 unknown
InChI: InChI=1S/C21H13N5O7/c27-21(24-22-12-15-8-10-20(33-15)26(30)31)17-11-13(23-18-4-2-1-3-16(17)18)5-6-14-7-9-19(32-14)25(28)29/h1-12,24H
charge 0 multiplicity 1
46 atoms
O  6.141753 -1.616316 -0.190077
O  -1.115806 -0.321756 -2.217692
O  -6.802787 -0.449564 0.677646
O  8.970095 -3.801248 -0.458187
O  6.790752 -4.070319 -1.154479
O  -10.152296 -1.651121 0.259417
O  -9.173274 -0.502456 1.999524
N  2.526433 1.998458 0.573002
N  -2.278241 0.43846 -0.318731
N  -3.47062 -0.11523 -0.712462
N  7.741446 -3.396259 -0.593843
N  -9.144614 -1.067042 0.836706
C  0.113794 2.314705 0.015524
C  0.096558 0.989934 -0.562875
C  1.375594 2.759422 0.59329
C  2.491668 0.782372 -0.036452
C  1.284571 0.255953 -0.612271
C  -0.994858 3.224855 0.012817
C  1.450818 4.055313 1.203603
C  -1.130993 0.327368 -1.144219
C  -0.88301 4.488048 0.60173
C  3.721282 -0.014444 -0.088504
C  0.341494 4.900825 1.216329
C  4.916661 0.417184 0.433487
C  6.142151 -0.330119 0.405992
C  7.437471 -0.046729 0.876284
C  7.449049 -2.094282 -0.069278
C  8.268738 -1.16938 0.573667
C  -5.757254 -0.596427 -0.260388
C  -4.488664 -0.030083 0.125958
C  -6.226947 -1.287876 -1.388607
C  -7.915903 -1.064658 0.097408
C  -7.605151 -1.586722 -1.157716
H  1.288064 -0.731119 -1.085283
H  -1.925203 2.950706 -0.495729
H  2.410594 4.35086 1.637376
H  -1.735539 5.175249 0.580739
H  3.663032 -0.996354 -0.573478
H  0.408296 5.89128 1.678301
H  4.951517 1.40388 0.909692
H  -2.179112 0.901116 0.59952
H  7.737106 0.870472 1.379102
H  9.325463 -1.304044 0.787748
H  -4.444717 0.449067 1.12129
H  -5.626455 -1.536891 -2.260142
H  -8.296857 -2.112993 -1.810042
