program: Gaussian 09
title: 000202520
version: EM64L-G09RevD.01
frameworkgroup: C1[X(C16H23NO3)]
method: RPBEPBE
basis: SDD
operation: Freq
keyword: #p
keyword: freq=noraman
keyword: PBEPBE/SDD
title: #p freq=noraman PBEPBE/SDD
converged: YES YES NO NO
title: Mulliken charges:
elementType: O O O N C C C C C C C C C C C C C C C C H H H H H H H H H H H H H H H H H H H H H H H
charge: -0.407748 -0.231202 -0.244145 0.096460 0.077018 0.146352 0.393384 0.361591 -0.101244 -0.746604 -0.692689 -0.692769 -0.748477 -0.726260 -0.726446 -0.628841 -0.598861 0.568311 -0.316996 -0.218373 0.225190 0.224761 0.224645 0.238417 0.222700 0.201958 0.222886 0.238515 0.201731 0.226090 0.216941 0.217090 0.212682 0.207884 0.259513 0.207848 0.212669 0.259750 0.264417 0.259050 0.343072 0.279207 0.270522
chargesum: 0.00000
title: Mulliken charges with hydrogens summed into heavy atoms:
elementType: O O O N C C C C C C C C C C C C C C C C
charge: -0.064676 -0.231202 -0.244145 0.096460 0.077018 0.146352 0.393384 0.361591 -0.101244 -0.072008 -0.029615 -0.029637 -0.088355 -0.046181 -0.046180 -0.364424 -0.339811 0.568311 -0.037789 0.052150
polarizability: 3.40480731e+02 1.12248412e+00 2.21206395e+02 -8.49171096e-03 -5.66944911e-03 1.23225140e+02
1716.lowfreq: -0.0010 -0.0009 -0.0008 1.3144 4.2229 10.8591 35.5556 44.6139 57.9777
frequency: 35.4454 44.5740 57.9694 64.5822 71.3856 107.9226 145.1693 149.2566 159.8659 167.7689 189.9271 205.5565 211.8745 227.5290 240.1349 242.6834 258.6030 288.9976 300.8197 310.0198 318.2825 336.8416 339.1777 343.6605 372.4029 382.4675 388.0399 396.8567 411.1617 433.3096 449.4009 493.8152 518.5364 534.3172 581.0145 601.6515 622.2353 624.3645 683.0882 688.9026 745.2958 788.2631 795.1241 808.8307 843.2627 883.2598 905.7530 912.2276 916.9458 924.1708 931.2684 935.2974 942.1662 949.5380 950.7885 974.0790 1006.5754 1022.8303 1024.1270 1026.9912 1033.5200 1108.1384 1143.5407 1184.0373 1199.6306 1200.4773 1203.1531 1210.5929 1222.0951 1233.8933 1247.6288 1254.9618 1285.8449 1296.5157 1323.5100 1371.4740 1375.5872 1376.8067 1383.0609 1388.5608 1393.1724 1401.1977 1415.5709 1427.8693 1443.2710 1458.6767 1459.5273 1467.7953 1472.9471 1475.7934 1477.2660 1480.6228 1489.8384 1491.2636 1492.9234 1502.6349 1507.2872 1581.3115 1608.4048 1627.3385 2971.4124 2977.4455 2978.3116 2979.5484 2982.9536 2983.2558 3061.9484 3063.5770 3065.9155 3066.8870 3069.3301 3076.4293 3077.0508 3079.0359 3083.9724 3086.6089 3114.1441 3116.8152 3119.6713 3161.3475 3176.2187 3202.4330 3587.5905
redmass: 4.4072 5.3101 4.2935 6.2503 2.7503 4.4989 3.2345 2.8647 1.1718 2.4021 1.4308 1.1371 3.0730 3.3591 1.2528 3.5242 2.0839 3.9231 2.0458 2.5987 2.1042 1.0576 4.7717 1.1449 1.9001 2.1675 3.7927 2.7585 1.8307 2.8190 3.6605 3.6426 3.0700 4.1238 5.0836 3.4340 4.1437 4.3072 6.5188 8.5504 4.8514 5.4766 4.0314 3.0386 1.7063 2.5108 1.5479 1.7771 1.5894 1.5873 1.6966 1.6696 5.8933 1.1967 1.2149 3.4294 1.2872 1.4360 1.4212 1.3767 1.3759 2.8708 1.5553 2.4389 2.8825 3.1579 2.9353 2.8136 1.8982 3.7416 2.0779 2.1632 1.5771 1.6823 3.3349 1.2398 3.9259 1.1825 1.3148 3.7209 1.1620 1.2531 1.3061 2.4293 2.9646 1.0483 1.0506 1.0671 1.0669 1.0533 1.0486 1.0573 1.1356 1.0509 1.0538 1.0654 1.0647 6.1083 5.2825 5.6133 1.0354 1.0359 1.0353 1.0373 1.0370 1.0377 1.0979 1.1003 1.0974 1.0993 1.0999 1.0992 1.0982 1.1010 1.0999 1.0995 1.0887 1.0971 1.0965 1.0907 1.0900 1.0944 1.0648
irintensity: 0.0458 0.0136 0.7124 2.0127 0.1815 0.7210 0.2743 0.1525 8.5664 1.5471 1.8210 0.3290 0.3597 0.3206 0.0049 2.2942 0.0828 3.4845 10.8524 0.1678 42.3208 0.0183 1.3885 2.8970 31.1806 8.1798 1.2361 0.7703 31.0671 1.9060 3.8366 5.3218 8.9392 3.0265 24.5075 1.6649 3.5891 1.3444 0.1361 2.4879 0.9550 14.5579 3.5640 0.7471 36.5259 15.5555 0.0013 0.5168 2.3957 6.4149 1.5263 5.2918 32.7766 1.3070 0.2070 4.7418 47.7342 3.4090 5.9666 0.0803 0.9432 37.9835 108.3767 494.7622 9.4112 348.2384 6.5309 0.3884 218.0341 13.2740 31.2176 53.0072 9.4154 8.5107 21.3488 15.7904 147.5005 24.0499 22.6320 8.5445 18.9031 38.0816 67.9371 104.1997 46.7253 0.1741 0.2361 2.5219 7.4041 3.4146 0.0700 3.0617 4.4537 9.7425 10.8086 25.1857 18.8547 19.4211 83.6015 268.6001 18.4480 19.6261 33.8878 44.3877 31.2211 34.2794 1.3248 2.4275 69.6289 13.7897 48.0625 30.9644 87.2292 1.7399 37.8148 80.9174 0.0024 0.2191 21.0876 3.2525 2.5439 9.7094 136.0805
temp: 298.150 k
press: 1.00000 atm
elementType: 8 8 8 7 6 6 6 6 6 6 6 6 6 6 6 6 6 6 6 6 1 1 1 1 1 1 1 1 1 1 1 1 1 1 1 1 1 1 1 1 1 1 1
symmnumber: 1
zpe: 939583.2 jmol-1
zpe.correction: 0.357868 hartree
zpe.thermalcorrener: 0.379631 hartree
zpe.thermalcorrenthalpy: 0.380575 hartree
zpe.thermalcorrgfe: 0.308360 hartree
zpe.sumelectzpe: -902.300978 hartree
zpe.sumelectthermal: -902.279215 hartree
zpe.sumelectthermalent: -902.278271 hartree
zpe.sumelectthermalfe: -902.350486 hartree
dipole: -9.0900 -0.8323 0.0040
dipole: 9.1280
quadrupole: -161.8833 -112.5482 -122.6344
quadrupole: 14.1154 -0.0491 -0.0134
quadrupole: -29.5280 19.8071 9.7209 14.1154 -0.0491 -0.0134
hfenergy: -902.6588462 hartree
pointgroup: C01 [X(C16H23N1O3)]
dipole: -3.5716928 -0.3711452 -0.0461813 debye
polarizability: 340.4017392|2.5690513|221.2429725|2.7053099|0.9561344|123.2675542 unknown
InChI: InChI=1S/C16H23NO3/c1-15(2,3)12-9-11(7-8-17(19)20)10-13(14(12)18)16(4,5)6/h7-10,18H,1-6H3
charge 0 multiplicity 1
43 atoms
O  -3.091443 0.563762 -0.009795
O  5.820777 0.541133 0.098992
O  5.080935 -1.628364 0.066882
N  4.871556 -0.347342 0.077095
C  -2.32585 -2.331664 -0.031643
C  -1.290318 2.797469 0.029447
C  -1.310546 -1.152456 -0.007501
C  -0.808408 1.323053 0.021221
C  -1.729572 0.220103 0.001276
C  -1.607312 -3.709347 -0.037826
C  -3.193947 -2.288664 -1.332782
C  -3.223824 -2.316561 1.249686
C  -0.099185 3.793083 0.050296
C  -2.149149 3.072791 1.302749
C  -2.124855 3.095507 -1.254864
C  0.078226 -1.390367 0.006389
C  0.561128 1.0040 0.033892
C  1.032801 -0.338743 0.027536
C  2.446343 -0.69251 0.041974
C  3.512037 0.163998 0.064178
H  -2.366143 -4.512538 -0.055655
H  -0.966594 -3.837468 -0.928832
H  -0.98871 -3.856871 0.865725
H  -2.545706 -2.373191 -2.223162
H  -3.900851 -3.1384 -1.338217
H  -3.790137 -1.365994 -1.464191
H  -3.929805 -3.166626 1.221113
H  -2.596112 -2.419326 2.152772
H  -3.824238 -1.397462 1.387009
H  -0.497401 4.823569 0.056026
H  0.526246 3.674824 0.954737
H  0.544411 3.691838 -0.843444
H  -1.554988 2.901135 2.21966
H  -2.480223 4.128394 1.30334
H  -3.041685 2.429662 1.336352
H  -2.456711 4.15078 -1.24273
H  -1.513189 2.940631 -2.163215
H  -3.015824 2.452337 -1.316539
H  0.449915 -2.41872 0.00094
H  1.288351 1.818731 0.049222
H  -3.657389 -0.245605 -0.020531
H  2.697658 -1.762524 0.034928
H  3.480136 1.253843 0.074591
