program: Gaussian 09
title: 000202502
version: EM64L-G09RevD.01
frameworkgroup: C1[X(C14H13N3)]
method: RPBEPBE
basis: SDD
operation: Freq
keyword: #pfreq=noraman
keyword: PBEPBE/SDD
title: #p freq=noraman PBEPBE/SDD
converged: YES YES NO NO
title: Mulliken charges:
elementType: N N N C C C C C C C C C C C C C C H H H H H H H H H H H H H
charge: -0.283001 -0.005284 -0.057471 -0.281310 -0.564213 0.499427 0.415427 -0.439293 -0.347635 -0.334480 -0.380740 -0.220459 -0.229720 -0.241258 -0.229520 -0.199935 -0.259121 0.261944 0.263239 0.253765 0.232807 0.249984 0.248519 0.278361 0.229031 0.230225 0.232174 0.223725 0.226273 0.228542
chargesum: 0.00000
title: Mulliken charges with hydrogens summed into heavy atoms:
elementType: N N N C C C C C C C C C C C C C C
charge: -0.283001 -0.005284 -0.057471 -0.019366 -0.047209 0.499427 0.415427 -0.206486 -0.097651 -0.085961 -0.102380 0.008572 0.000504 -0.009084 -0.005795 0.026338 -0.030580
polarizability: 1.97529761e+02 7.55783715e+00 1.83557585e+02 -1.54775369e+01 9.74347947e+00 1.27027666e+02
1716.lowfreq: -10.0536 -4.2408 -0.0008 -0.0007 -0.0005 7.5757 32.5708 38.4229 48.2998
frequency: 32.5493 38.3901 48.2629 74.7029 119.0863 155.5397 186.4002 251.7005 272.9158 304.1750 362.1886 401.8450 407.8199 451.1241 476.6696 506.2923 545.5171 604.2644 612.8121 614.5140 665.1357 694.0230 705.0203 752.9937 758.5964 768.5857 807.5551 826.1193 834.0540 854.9821 877.4913 903.7463 922.8613 950.0781 969.9847 972.0376 978.9727 983.1772 989.9484 990.1717 998.8326 1015.9570 1020.2587 1031.6526 1036.4895 1085.3274 1095.5589 1141.6166 1172.1736 1173.9397 1187.9660 1191.1543 1211.2639 1247.9399 1259.5820 1295.3807 1327.1629 1339.9114 1347.3246 1381.2907 1388.1543 1408.7871 1444.6307 1449.1124 1458.6814 1482.7670 1489.2396 1587.7564 1595.9446 1612.1605 1613.7135 2999.1924 3030.1079 3093.1605 3111.1726 3125.7648 3128.9014 3136.6458 3138.3563 3148.4474 3157.8657 3166.0779 3169.5618 3183.5903
redmass: 3.7864 4.7382 4.1851 5.2765 4.0489 4.9062 3.4945 4.3932 5.0833 5.0508 5.6877 2.8134 2.9158 5.2579 4.2516 3.0681 3.3285 5.9242 6.4337 6.4418 6.1509 1.9999 1.7440 3.8271 1.6861 1.8685 7.1788 5.9062 1.2739 1.2565 5.8133 1.4312 1.4726 3.1441 1.4685 2.8178 1.4168 5.2906 4.8690 1.3864 1.3385 4.2497 2.8408 2.3147 2.1165 1.5819 1.5769 1.1671 1.0493 1.0540 1.1114 1.1254 2.1799 1.3924 1.3768 1.5436 1.3379 3.8401 1.3906 6.6967 5.3789 4.2155 2.0498 2.2481 1.2928 2.2791 2.5808 6.4890 6.0588 6.1269 6.0012 1.0849 1.0614 1.1060 1.0884 1.0864 1.0849 1.0906 1.0898 1.0958 1.0939 1.1014 1.0975 1.0960
irintensity: 0.0305 0.2898 1.2789 4.8229 3.0835 1.2559 0.5665 1.0036 1.4350 0.6279 0.6155 0.0947 0.0270 2.3910 3.0894 10.0332 9.8356 5.8816 0.3991 0.1570 2.9303 37.4074 40.8975 0.5401 83.2354 67.4487 37.8892 1.3669 0.0548 1.0408 79.6538 9.4787 3.1523 38.6956 1.4706 29.4046 0.0874 8.5041 0.8036 1.8130 0.1548 84.1018 15.3327 20.8028 3.1971 12.3479 26.3687 5.1866 0.1493 0.1177 0.9979 0.2761 3.7882 40.4129 25.1265 9.5956 5.0745 71.6100 12.3465 13.4559 2.7082 72.8210 21.1118 7.2868 36.4925 15.3294 120.2494 3.5394 1.4291 52.2410 40.8152 14.9800 21.5252 9.6901 9.8285 1.7748 1.8702 7.6347 15.6528 30.7364 35.6651 22.6717 12.2527 2.6915
temp: 298.150 k
press: 1.00000 atm
elementType: 7 7 7 6 6 6 6 6 6 6 6 6 6 6 6 6 6 1 1 1 1 1 1 1 1 1 1 1 1 1
symmnumber: 1
zpe: 624168.8 jmol-1
zpe.correction: 0.237733 hartree
zpe.thermalcorrener: 0.251340 hartree
zpe.thermalcorrenthalpy: 0.252284 hartree
zpe.thermalcorrgfe: 0.195633 hartree
zpe.sumelectzpe: -704.304674 hartree
zpe.sumelectthermal: -704.291068 hartree
zpe.sumelectthermalent: -704.290124 hartree
zpe.sumelectthermalfe: -704.346775 hartree
dipole: 2.2637 -2.6691 -1.8065
dipole: 3.9386
quadrupole: -91.6658 -106.3358 -93.3057
quadrupole: 1.1312 -2.8224 -3.5556
quadrupole: 5.4367 -9.2333 3.7967 1.1312 -2.8224 -3.5556
hfenergy: -704.5424078 hartree
pointgroup: C01 [X(C14H13N3)]
dipole: 0.6201174 1.1840808 0.783906 debye
polarizability: 193.1757693|-6.4703061|182.3762273|24.7241233|9.3120589|132.5630158 unknown
InChI: InChI=1S/C14H13N3/c1-3-7-12(8-4-1)14-11-15-16-17(14)13-9-5-2-6-10-13/h1-10,14H,11H2
charge 0 multiplicity 1
30 atoms
N  -0.522128 -1.225181 0.103499
N  -0.484788 -2.510229 -0.478015
N  0.524531 -3.203853 -0.060042
C  0.644137 -0.978161 1.009537
C  1.323686 -2.389743 0.950944
C  1.555754 0.154932 0.545341
C  -1.614569 -0.357554 -0.141915
C  2.120204 1.042366 1.493685
C  1.888401 0.303187 -0.824323
C  -1.658205 0.926805 0.464059
C  -2.681503 -0.77299 -0.986904
C  3.011084 2.059912 1.08321
C  2.774623 1.321462 -1.236318
C  3.340899 2.201999 -0.284097
C  -2.75815 1.779107 0.226449
C  -3.768594 0.092278 -1.21492
C  -3.819722 1.372831 -0.612166
H  0.278173 -0.759263 2.030686
H  2.370943 -2.340847 0.610329
H  1.290078 -2.925862 1.914836
H  1.864586 0.936965 2.556204
H  1.441876 -0.368777 -1.56707
H  -0.83593 1.27055 1.098055
H  -2.643633 -1.763577 -1.446202
H  3.442074 2.741072 1.825419
H  3.020852 1.432124 -2.298156
H  4.027681 2.99281 -0.605336
H  -2.777877 2.76808 0.698003
H  -4.584507 -0.238299 -1.867595
H  -4.669374 2.038958 -0.794699
