program: Gaussian 09
title: 000202599
version: EM64L-G09RevD.01
frameworkgroup: C1[X(C23H34NO2)]
method: RPBEPBE
basis: SDD
operation: Freq
keyword: #p
keyword: freq=noraman
keyword: PBEPBE/SDD
title: #p freq=noraman PBEPBE/SDD
converged: YES YES NO NO
title: Mulliken charges:
elementType: O O N C C C C C C C C C C C C C C C C C C C C C C C H H H H H H H H H H H H H H H H H H H H H H H H H H H H H H H H H H
charge: -0.368669 -0.488237 -0.107589 -0.364451 -0.340019 -0.312947 -0.578133 -0.454990 -0.402271 -0.387618 -0.288594 -0.666705 -0.668000 0.233091 0.301387 -0.431307 -0.359439 -0.367026 0.492693 -0.225607 -0.239119 -0.415982 -0.350018 -0.229034 -0.231075 -0.233482 0.256378 0.311669 0.226665 0.327688 0.255475 0.243767 0.270384 0.260195 0.261156 0.241769 0.242055 0.226492 0.219709 0.238245 0.244248 0.219143 0.247871 0.232874 0.218615 0.244434 0.217977 0.218675 0.249194 0.241935 0.251370 0.247409 0.245324 0.246779 0.232136 0.246828 0.381261 0.238166 0.235430 0.241826
chargesum: 1.00000
title: Mulliken charges with hydrogens summed into heavy atoms:
elementType: O O N C C C C C C C C C C C C C C C C C C C C C C C
charge: -0.368669 -0.106976 -0.107589 0.203596 0.214334 0.186295 0.213601 0.028833 0.043930 0.094875 0.178421 0.029218 0.017846 0.233091 0.301387 -0.189372 -0.108070 -0.119617 0.492693 0.019717 0.007660 -0.183846 -0.103190 0.009131 0.004355 0.008344
polarizability: 2.51982959e+02 1.61276984e+00 2.82469975e+02 6.48342251e+00 9.98209049e+00 2.32584885e+02
1716.lowfreq: -15.5667 -8.2107 -5.4697 -0.0004 0.0003 0.0004 8.3931 12.0010 17.2035
frequency: 7.6059 11.4097 16.7455 36.4080 38.4912 54.4236 64.4642 68.4759 81.3307 85.7455 99.3939 128.3412 138.4412 154.1914 173.2850 196.3202 211.4064 222.5161 233.2333 235.7053 244.9409 250.7323 258.8932 275.4164 294.3427 301.9591 304.4044 330.7261 344.6300 351.3316 370.0250 400.4518 406.1302 430.2524 458.0680 479.6082 500.1491 511.5175 527.0315 560.3864 566.3500 598.1112 612.1744 615.5509 647.6666 702.9335 710.3478 733.8108 741.2722 747.2913 762.2085 764.7959 771.6755 794.5769 810.3308 838.3170 851.7918 853.2934 860.1595 864.0013 893.8163 901.7976 907.8627 918.9308 925.1650 935.5389 937.4267 942.8387 948.7881 979.1698 988.6981 989.6027 990.7456 1003.6865 1026.6437 1037.9999 1041.6915 1044.3863 1046.7161 1075.5025 1084.3289 1088.2498 1100.9614 1104.4282 1128.5416 1131.3506 1157.8807 1169.9447 1177.0046 1179.6346 1182.9273 1188.6656 1189.7477 1192.7815 1210.0969 1217.1126 1246.8654 1251.2085 1262.9452 1264.2692 1272.5429 1299.4695 1303.5565 1307.0847 1315.9277 1322.5939 1329.8251 1333.0368 1337.3884 1359.4145 1364.5483 1379.8078 1382.6115 1386.2660 1405.5711 1407.8916 1416.4902 1430.4617 1435.0479 1439.1825 1442.9714 1462.3329 1465.7893 1469.2539 1472.5278 1476.3920 1478.9089 1482.3616 1482.6702 1482.8041 1484.7033 1486.6847 1488.3337 1490.4986 1500.1984 1505.7078 1588.3960 1593.9172 1609.1911 1610.7280 2989.3774 2989.7423 2992.8413 2995.1886 3003.9127 3009.5827 3012.3587 3014.7824 3019.7842 3027.8722 3046.7013 3047.8548 3059.3843 3060.7502 3066.5088 3080.2475 3083.8851 3090.0801 3094.1805 3098.7217 3100.7132 3102.4712 3120.1815 3130.7101 3132.3611 3138.7566 3142.4924 3143.3176 3150.0336 3153.0059 3158.1240 3169.2408 3176.7358 3369.3261
redmass: 3.7914 4.5563 3.8525 4.6637 2.8188 2.1899 3.0275 4.3384 4.4332 3.5962 1.7177 3.3495 3.6714 4.4779 2.5960 3.1974 2.7066 1.7343 1.1836 1.4177 2.0670 1.5429 2.9808 3.0285 4.0668 3.5069 3.9789 2.9879 2.4448 2.9722 3.4068 2.7833 3.5208 3.6474 2.8792 3.7699 2.6182 3.4582 1.6546 3.7129 2.6722 3.7012 5.4654 5.9185 5.0778 1.7327 3.7873 2.4886 1.1979 2.4302 1.3702 1.2998 1.8751 1.8280 2.7988 2.2296 1.8513 1.6542 1.7221 1.7087 1.7711 1.4044 3.0392 1.8713 3.1481 1.8727 1.8410 1.9661 1.4293 1.3964 2.4391 1.5241 5.9179 1.3272 2.2676 2.7468 3.2355 2.3532 2.7570 2.1540 1.6888 1.5731 1.8855 2.3844 1.9978 1.7874 1.8249 2.1216 1.0705 1.1324 1.8117 1.9239 2.0861 1.1412 1.7805 1.3779 1.3138 1.2187 1.5531 1.2488 1.2426 1.2100 1.4330 1.2051 1.3003 1.2299 1.2166 1.1961 1.3066 1.3388 1.2889 4.9768 1.3156 6.2345 1.1999 1.1962 1.2405 1.4358 1.1592 1.6678 2.0175 1.0852 1.0747 1.0665 1.7039 1.0562 1.0577 1.0424 2.1158 1.0862 1.0397 1.3667 1.0620 1.0833 1.0892 1.0789 6.5765 5.9836 6.6223 6.0793 1.0374 1.0584 1.0376 1.0587 1.0614 1.0598 1.0600 1.0597 1.0591 1.0340 1.0863 1.1016 1.1019 1.1024 1.1057 1.1028 1.1043 1.1069 1.1039 1.1047 1.0991 1.0999 1.0883 1.0861 1.0890 1.1040 1.0910 1.0880 1.1041 1.0960 1.0936 1.1015 1.1007 1.0652
irintensity: 0.1843 0.1950 0.0652 1.4513 1.5740 0.9315 0.1862 2.4471 4.2876 1.2646 1.0692 2.5079 4.0344 0.6067 2.4681 1.0719 2.5818 1.9285 0.3947 0.7209 7.9644 2.3870 0.7867 2.1830 2.2196 1.3950 1.4457 0.5182 0.2278 1.0303 8.5427 0.0465 1.7766 4.9223 3.4089 4.5697 10.6933 21.9716 104.3794 8.5992 16.7462 65.3332 24.5605 10.8047 5.9233 51.5463 15.9582 1.2396 13.4759 8.5821 80.4559 1.0293 93.5859 0.5168 2.6472 14.2453 28.9396 27.3848 11.9243 5.0960 4.5745 7.0660 89.9523 2.0026 34.1049 37.4376 22.5004 32.2898 2.3648 0.1567 1.9183 0.6708 1.9267 0.0671 2.9976 33.5181 2.0672 8.4911 17.3043 5.7447 8.3315 0.5329 16.1039 58.2709 6.8517 2.1047 8.8473 73.0195 0.7335 2.9983 3.1865 6.1876 44.0652 2.3220 19.8851 15.1364 41.2624 6.0204 12.7545 1.0723 0.6685 5.2949 5.8442 0.8643 6.3133 1.6173 16.5311 7.8237 1.5169 2.7529 0.3176 0.3947 4.6056 0.9713 9.6139 12.7667 2.3153 97.0594 22.6375 8.8063 30.5120 8.5831 7.9018 4.6984 57.1910 6.0534 7.1271 22.1707 10.3177 10.2901 23.4183 5.0565 12.9250 26.2567 9.4561 42.3227 13.2889 2.3383 7.8595 1.8370 21.4576 24.4610 10.4031 26.4411 26.2799 11.6786 9.7213 17.6069 27.1456 10.1975 15.6910 8.1565 13.5848 14.9795 15.9274 4.7026 20.9908 10.2604 36.1493 46.0361 16.2918 23.4306 7.5263 1.4464 5.0090 6.7514 7.2356 4.5799 7.5514 27.8416 12.6023 17.4808 10.8476 95.7047
temp: 298.150 k
press: 1.00000 atm
elementType: 8 8 7 6 6 6 6 6 6 6 6 6 6 6 6 6 6 6 6 6 6 6 6 6 6 6 1 1 1 1 1 1 1 1 1 1 1 1 1 1 1 1 1 1 1 1 1 1 1 1 1 1 1 1 1 1 1 1 1 1
symmnumber: 1
zpe: 1375979.8 jmol-1
zpe.correction: 0.524083 hartree
zpe.thermalcorrener: 0.551670 hartree
zpe.thermalcorrenthalpy: 0.552614 hartree
zpe.thermalcorrgfe: 0.462424 hartree
zpe.sumelectzpe: -1099.803400 hartree
zpe.sumelectthermal: -1099.775813 hartree
zpe.sumelectthermalent: -1099.774869 hartree
zpe.sumelectthermalfe: -1099.865059 hartree
dipole: -10.9850 -2.7701 -2.5156
dipole: 11.6048
quadrupole: -90.3195 -125.1946 -133.2885
quadrupole: 0.4878 7.2155 5.9703
quadrupole: 25.9481 -8.9271 -17.0210 0.4878 7.2155 5.9703
hfenergy: -1100.3274825 hartree
pointgroup: C01 [X(C23H34N1O2)]
dipole: 3.9875281 1.9377767 -1.090882 debye
polarizability: 252.9527169|-5.2808667|279.2410002|-3.2349928|-15.4905151|234.8441017 unknown
InChI: InChI=1S/C23H34NO2/c1-4-16-24(3,17-5-2)18-11-19-26-22-15-10-9-14-21(22)23(25)20-12-7-6-8-13-20/h6-10,12-15,23,25H,4-5,11,16-19H2,1-3H3
charge 1 multiplicity 1
60 atoms
O  -0.692877 0.903102 -1.498298
O  0.206678 -0.558108 0.486099
N  3.483256 0.916533 -0.635926
C  2.141884 1.645129 -0.903747
C  3.237067 -0.619629 -0.57683
C  4.064055 1.442611 0.707393
C  4.483909 1.2554 -1.733754
C  1.532817 1.438767 -2.306579
C  4.444389 -1.469731 -0.146965
C  3.213791 1.182553 1.961468
C  0.056205 1.886344 -2.306086
C  4.067215 -2.968684 -0.239976
C  3.942433 1.755606 3.200499
C  -1.755542 1.361179 -0.65412
C  -2.005475 0.61597 0.532309
C  -1.216096 -0.631181 0.947358
C  -2.537116 2.483565 -1.006664
C  -3.074859 1.048801 1.354469
C  -1.846654 -1.949705 0.493145
C  -3.593821 2.888925 -0.163233
C  -3.86435 2.170538 1.022185
C  -1.702618 -3.098453 1.311718
C  -2.526607 -2.067375 -0.745784
C  -2.221285 -4.345378 0.89944
C  -3.041967 -3.314745 -1.162096
C  -2.890567 -4.456807 -0.341852
H  2.340596 2.718044 -0.728263
H  1.442071 1.280156 -0.133764
H  2.921721 -0.913542 -1.593501
H  2.381641 -0.774344 0.104309
H  5.05762 0.974977 0.815894
H  4.215984 2.528313 0.561314
H  4.146784 0.823708 -2.686955
H  4.559158 2.35054 -1.824312
H  5.467981 0.841105 -1.471787
H  1.555308 0.37843 -2.617974
H  2.071583 2.022759 -3.075083
H  4.735613 -1.239273 0.894162
H  5.324714 -1.280332 -0.789826
H  3.044274 0.100368 2.10328
H  2.218084 1.651931 1.875614
H  -0.059247 2.898443 -1.871203
H  -0.34323 1.890179 -3.336151
H  3.188912 -3.202068 0.388136
H  3.831479 -3.263046 -1.278678
H  4.905842 -3.596685 0.104337
H  4.929976 1.28188 3.349968
H  4.095616 2.846989 3.115364
H  3.345054 1.573691 4.109441
H  -1.125123 -0.641572 2.047281
H  -2.353705 3.021183 -1.94269
H  -3.290963 0.488183 2.271695
H  -4.205596 3.75364 -0.439481
H  -4.683714 2.477876 1.678971
H  -1.183255 -3.01471 2.274689
H  -2.670654 -1.184711 -1.378852
H  0.124036 -0.367373 -0.493089
H  -2.112304 -5.224108 1.544199
H  -3.571358 -3.394865 -2.117828
H  -3.299559 -5.421493 -0.660992
