program: Gaussian 09
title: 000202519
version: EM64L-G09RevD.01
frameworkgroup: C1[X(C21H30O4)]
method: RPBEPBE
basis: SDD
operation: Freq
keyword: #pfreq=noraman
keyword: PBEPBE/SDD
title: #p freq=noraman PBEPBE/SDD
converged: YES YES NO NO
title: Mulliken charges:
elementType: O O O O C C C C C C C C C C C C C C C C C C C C C H H H H H H H H H H H H H H H H H H H H H H H H H H H H H H
charge: -0.409876 -0.292092 -0.248127 -0.265726 0.075301 0.141561 0.391853 0.347215 -0.107283 -0.748631 -0.695820 -0.694663 -0.740584 -0.730887 -0.732795 -0.655809 -0.581212 0.525432 -0.384272 0.091501 0.147406 0.159684 -0.777035 -0.260302 -0.665225 0.224565 0.222616 0.224695 0.202540 0.219528 0.237176 0.202831 0.237632 0.219334 0.213248 0.224700 0.226016 0.213438 0.204952 0.254979 0.256636 0.211823 0.205202 0.261229 0.337794 0.259379 0.339699 0.273721 0.236939 0.248931 0.218689 0.234653 0.251421 0.230581 0.215437
chargesum: 0.00000
title: Mulliken charges with hydrogens summed into heavy atoms:
elementType: O O O O C C C C C C C C C C C C C C C C C C C C C
charge: -0.070177 -0.292092 -0.248127 -0.265726 0.075301 0.141561 0.391853 0.347215 -0.107283 -0.076755 -0.036575 -0.034866 -0.076620 -0.057517 -0.059134 -0.394580 -0.243417 0.525432 -0.124892 0.091501 0.147406 0.159684 -0.017444 0.193041 0.032214
polarizability: 4.01644448e+02 -1.26119355e+00 2.61101106e+02 -7.73979540e+00 6.13562763e-01 1.70377691e+02
1716.lowfreq: -9.0539 -6.2382 -0.0001 0.0006 0.0008 4.9246 18.1299 22.5004 32.7269
frequency: 18.0254 22.3846 32.6892 42.0503 54.0021 61.9218 67.4071 70.2666 80.8764 97.0182 111.7371 132.1529 138.2642 152.4215 153.8988 171.7740 193.0569 194.6601 209.9879 213.6757 222.5174 240.8099 258.7957 261.8691 285.8251 301.8630 308.2687 310.7670 318.7202 327.4590 337.3502 340.2435 355.9715 375.0687 383.8103 390.2789 395.2848 413.0068 428.6004 432.6014 448.9261 477.3883 501.3747 508.3309 527.7588 572.4412 595.6821 612.1205 622.5563 640.6991 709.1436 714.3252 728.1677 751.1442 768.5379 792.5713 801.1027 815.2248 841.9482 884.4461 899.3886 913.5344 920.4789 930.3831 931.7749 946.3784 947.7750 949.7428 956.7527 965.3914 985.1701 1004.4091 1017.7842 1021.2119 1026.1488 1026.4760 1030.0036 1036.9467 1095.9215 1106.9116 1148.3641 1150.5309 1156.5696 1195.0877 1199.1590 1201.5796 1202.0625 1211.1137 1229.6401 1246.7442 1255.9233 1280.6928 1296.4289 1310.2710 1354.3938 1362.2824 1367.9555 1376.1515 1377.4022 1381.5891 1389.5494 1391.5664 1397.0185 1400.5998 1412.3326 1428.2512 1441.1081 1444.0532 1453.9918 1456.7442 1457.1610 1458.2950 1463.0034 1466.1723 1472.2145 1473.6731 1475.9828 1478.8468 1484.8979 1487.8051 1490.0926 1490.9452 1502.0814 1505.4346 1559.4545 1573.7154 1586.7528 1602.5424 1623.9347 2974.3589 2976.6624 2977.6292 2979.1586 2982.6321 2983.3329 2987.3354 2993.7313 3028.4431 3059.0656 3062.6181 3065.8198 3067.0384 3068.4590 3075.2229 3076.4394 3078.5416 3080.8330 3084.1698 3085.2133 3086.6641 3088.9562 3092.7612 3107.7681 3114.9354 3118.7611 3130.3802 3157.1340 3197.9715 3591.7694
redmass: 3.7976 4.5537 2.9519 3.2904 2.5243 1.8271 2.4148 2.4886 3.7244 4.4162 3.6537 1.2647 3.2009 2.3956 3.2591 4.0051 1.2175 1.2383 2.7553 2.8456 1.5334 1.1994 2.1914 3.1976 3.6028 2.1601 2.7089 2.6600 2.1946 1.0667 2.5875 1.5615 2.7261 3.8616 2.0953 2.7431 2.6425 1.7593 4.5060 2.8192 3.5747 3.7306 3.3710 3.4171 3.3589 4.5405 4.0388 3.9373 4.4981 3.4801 4.3222 3.7400 5.9991 4.7727 4.4876 4.4946 3.0318 1.3719 3.6740 2.4885 1.5647 1.6525 1.7578 1.7027 1.6609 1.2220 1.2042 3.0735 1.8150 1.7428 1.5694 2.2752 2.0893 1.4622 1.3986 1.4873 1.3890 2.8354 2.1586 2.9282 2.1747 2.1830 1.8899 2.7303 2.8557 3.1084 2.9971 3.0426 3.5169 1.9100 2.2095 1.1156 2.6767 1.9096 1.2682 1.2486 1.1845 1.3098 2.5634 1.2373 1.1627 1.2356 2.5806 1.3398 1.2306 2.2693 1.0817 2.2138 1.0960 1.0493 1.0781 1.0507 1.0438 1.0724 1.0677 1.0542 1.0521 1.0603 1.0516 1.1097 1.0504 1.0688 1.0641 1.0649 7.1805 6.4452 7.2833 5.5543 7.2487 1.0361 1.0364 1.0362 1.0352 1.0369 1.0363 1.0395 1.0362 1.0588 1.0982 1.1000 1.0993 1.0978 1.0862 1.0990 1.0988 1.1008 1.0998 1.0997 1.0994 1.0912 1.0974 1.1041 1.0983 1.0970 1.1055 1.1018 1.0900 1.0917 1.0647
irintensity: 0.4925 2.3551 1.1354 0.4169 0.3961 1.1133 0.2175 1.2135 0.5539 0.0745 0.5711 2.1920 0.4018 3.8092 4.3362 0.5549 3.4486 0.4357 0.4449 1.5675 1.5041 0.1082 1.9042 9.1043 2.7618 6.1499 16.8888 3.8954 15.4759 0.5991 1.0343 4.0069 27.9353 0.4096 12.6536 16.1401 1.8231 41.0171 15.4115 1.7623 3.2655 3.2181 2.4912 23.7511 3.4170 11.7764 31.3802 1.5994 0.7047 7.7470 8.0435 11.0385 9.7012 0.1428 6.4316 5.5476 10.8040 0.9867 7.0626 16.6622 6.3887 2.6598 1.2318 0.9443 6.8424 1.2254 1.9569 18.1826 10.4777 14.2770 33.5227 8.5581 50.7094 0.7867 1.7899 7.2566 1.6361 241.6401 53.0933 62.8084 263.6146 654.7989 64.0899 4.4696 14.4840 121.4726 76.3450 6.4593 24.7393 27.8688 46.1617 5.7763 25.4519 12.1203 11.4027 47.4529 26.1208 15.9349 23.2168 21.9483 17.8271 29.2703 36.5453 33.2546 70.1771 291.5607 10.1690 8.0920 21.9985 0.2405 34.6410 0.1994 10.9838 2.2956 8.8329 3.9166 1.6105 3.1543 15.7598 4.3772 8.2149 9.3675 25.8347 17.5947 361.5395 157.4503 179.8842 9.7123 129.8825 27.3363 43.2843 22.1289 28.8081 52.5953 22.0371 5.0400 24.5524 43.6788 18.4060 13.2468 22.9484 41.1788 1.5077 36.6703 96.9715 1.4316 34.5001 44.0054 84.2919 10.4316 39.9608 1.2663 7.4535 17.4360 31.6190 7.2105 3.7361 17.7956 125.2410
temp: 298.150 k
press: 1.00000 atm
elementType: 8 8 8 8 6 6 6 6 6 6 6 6 6 6 6 6 6 6 6 6 6 6 6 6 6 1 1 1 1 1 1 1 1 1 1 1 1 1 1 1 1 1 1 1 1 1 1 1 1 1 1 1 1 1 1
symmnumber: 1
zpe: 1211098.3 jmol-1
zpe.correction: 0.461283 hartree
zpe.thermalcorrener: 0.490232 hartree
zpe.thermalcorrenthalpy: 0.491176 hartree
zpe.thermalcorrgfe: 0.401008 hartree
zpe.sumelectzpe: -1117.202737 hartree
zpe.sumelectthermal: -1117.173788 hartree
zpe.sumelectthermalent: -1117.172844 hartree
zpe.sumelectthermalfe: -1117.263012 hartree
dipole: 1.5825 -2.8986 1.2885
dipole: 3.5450
quadrupole: -123.5947 -154.3732 -150.5947
quadrupole: -10.9057 -2.0086 1.9437
quadrupole: 19.2595 -11.5190 -7.7405 -10.9057 -2.0086 1.9437
hfenergy: -1117.6640204 hartree
pointgroup: C01 [X(C21H30O4)]
dipole: -0.5460995 1.2823486 0.0502101 debye
polarizability: 400.3742227|-6.6675638|249.8560853|14.9301536|-31.0822376|182.8929371 unknown
InChI: InChI=1S/C21H30O4/c1-9-25-19(24)15(13(2)22)10-14-11-16(20(3,4)5)18(23)17(12-14)21(6,7)8/h10-12,23H,9H2,1-8H3
charge 0 multiplicity 1
55 atoms
O  -4.222774 -0.021233 -0.013807
O  4.931134 -0.149317 0.440273
O  1.893351 -2.230194 1.033619
O  4.002867 1.763325 -0.520182
C  -3.130936 2.666656 -0.766139
C  -2.672837 -2.351185 0.647375
C  -2.256908 1.432876 -0.397896
C  -2.035267 -0.982647 0.289739
C  -2.828287 0.164999 -0.039833
C  -2.260383 3.910768 -1.097973
C  -4.039651 3.085476 0.437134
C  -3.984243 2.381001 -2.046074
C  -1.593897 -3.421582 0.966189
C  -3.51936 -2.881197 -0.550791
C  -3.573434 -2.205155 1.91314
C  -0.851678 1.511155 -0.408322
C  -0.635565 -0.826066 0.267596
C  -0.012291 0.413151 -0.058833
C  1.425643 0.664646 -0.104793
C  2.540237 0.03081 0.424854
C  2.520071 -1.172601 1.334725
C  3.847273 0.664659 0.075589
C  3.190605 -1.034961 2.696493
C  6.288321 0.332588 0.039067
C  6.609733 -0.093166 -1.396371
H  -1.606696 3.735712 -1.97127
H  -2.922807 4.76093 -1.342882
H  -1.630724 4.213116 -0.241942
H  -4.747295 2.307151 0.77927
H  -4.639247 3.972787 0.162293
H  -3.414286 3.347163 1.309294
H  -4.68069 1.52616 -1.957245
H  -3.320019 2.15706 -2.899746
H  -4.588389 3.271046 -2.301227
H  -2.100754 -4.369199 1.224953
H  -0.932515 -3.620667 0.103536
H  -0.957971 -3.135225 1.823086
H  -2.882788 -3.02318 -1.443847
H  -3.959618 -3.861277 -0.28668
H  -4.336951 -2.189498 -0.806172
H  -4.397006 -1.49425 1.74497
H  -2.977084 -1.858471 2.777694
H  -4.008308 -3.189146 2.171969
H  -0.369453 2.455299 -0.677213
H  0.003907 -1.685272 0.466679
H  1.692741 1.592037 -0.637926
H  -4.691218 0.810997 -0.264454
H  4.235622 -0.703166 2.593001
H  2.653347 -0.269383 3.289902
H  3.147092 -1.999707 3.225499
H  6.959398 -0.144899 0.771456
H  6.318996 1.43071 0.149018
H  5.936079 0.40673 -2.111856
H  6.510439 -1.185959 -1.51318
H  7.64967 0.189496 -1.64516
