program: Gaussian 09
title: 000202508
version: EM64L-G09RevD.01
frameworkgroup: C1[X(C20H19NO2)]
method: RPBEPBE
basis: SDD
operation: Freq
keyword: #p
keyword: freq=noraman
keyword: PBEPBE/SDD
title: #p freq=noraman PBEPBE/SDD
converged: YES YES NO NO
title: Mulliken charges:
elementType: O O N C C C C C C C C C C C C C C C C C C C C H H H H H H H H H H H H H H H H H H H
charge: -0.349170 -0.274225 -0.165439 -0.447003 -0.446658 -0.356801 -0.350953 0.322761 -0.017553 0.385956 0.324910 -0.370787 -0.368036 -0.365655 -0.383937 0.293834 -0.231885 -0.235277 -0.240195 -0.222583 -0.242038 -0.246175 -0.538071 0.231293 0.223689 0.229122 0.224692 0.232229 0.251485 0.221326 0.246884 0.254154 0.256753 0.252948 0.262627 0.225056 0.226333 0.224088 0.223726 0.226348 0.227700 0.284527
chargesum: 0.00000
title: Mulliken charges with hydrogens summed into heavy atoms:
elementType: O O N C C C C C C C C C C C C C C C C C C C C
charge: -0.349170 -0.274225 -0.165439 0.007979 0.007156 0.126913 0.117258 0.322761 -0.017553 0.385956 0.324910 -0.116633 -0.111282 -0.112707 -0.121310 0.293834 -0.006829 -0.008943 -0.016107 0.001144 -0.015691 -0.018476 -0.253544
polarizability: 2.20616975e+02 4.39919778e+00 2.39757804e+02 -3.99265718e+00 1.15297817e+01 1.95004861e+02
1716.lowfreq: -8.8860 -5.5251 -0.0009 -0.0007 -0.0003 2.0611 22.0543 24.4089 36.4168
frequency: 21.6228 24.1825 36.3895 47.9308 53.9864 67.1771 78.7964 98.4444 114.5917 126.1973 161.2907 193.7501 207.2085 219.7166 232.5110 240.5696 268.3401 301.2321 303.7049 383.9395 391.1640 400.4288 403.6912 428.8974 497.2697 507.0901 540.5946 568.5923 614.8554 615.1634 617.4363 624.3706 635.0396 670.3495 686.0193 689.3404 701.4489 703.4670 713.2513 761.2109 771.7825 778.8078 852.6093 854.3510 856.8218 864.3129 888.3109 911.6229 912.0920 923.0312 929.2349 943.4165 967.0149 980.0888 982.1005 990.7063 992.0239 995.5583 997.8453 1004.6954 1016.5140 1029.5074 1038.8389 1060.6033 1084.9855 1092.2373 1118.6490 1157.4831 1161.0634 1171.4748 1172.2594 1183.4264 1187.7167 1190.8257 1194.6822 1208.9863 1217.5777 1241.9366 1302.6465 1313.1462 1316.3616 1321.9602 1322.8894 1339.5084 1357.3857 1379.8523 1384.4256 1433.5433 1437.7829 1471.1018 1476.4639 1478.7097 1481.0305 1490.8226 1498.3823 1591.5834 1595.3708 1609.4052 1612.6114 1655.6476 2136.7002 2975.0153 2986.2960 3011.3556 3012.1076 3061.0019 3063.9005 3079.5378 3093.4698 3122.6146 3123.6166 3131.9926 3133.4495 3144.4457 3146.3641 3156.9476 3160.6621 3168.5728 3177.7017 3429.9567
redmass: 3.8925 4.4450 3.9692 3.8047 4.5453 3.9554 3.2350 4.3093 4.4528 5.6776 4.7168 4.3825 4.1544 4.6456 5.0990 1.6394 5.0011 5.0935 6.7692 5.4803 5.7001 2.8274 2.8844 6.5753 6.3299 4.3373 3.6504 1.8827 3.4017 3.5250 2.9507 2.9294 6.2650 1.2686 5.4515 9.3821 1.8928 1.8828 3.8084 2.2231 2.0309 2.3443 1.6430 1.3690 1.2600 1.9158 4.5796 2.9054 2.9466 1.3903 1.4386 1.9561 2.0158 1.4135 1.3977 5.6882 4.5300 1.3388 1.3994 4.0608 4.1523 2.1152 2.4323 1.9483 1.5819 1.6970 1.5937 1.6780 1.4727 1.0606 1.0516 2.4229 1.4608 1.1627 1.9851 4.0967 1.3077 1.3637 1.3396 1.2254 1.3325 1.3495 1.6559 1.5106 4.2050 8.5405 9.5967 2.2181 2.2392 1.0883 1.0917 2.2136 2.2184 1.0774 1.0903 6.2547 6.3806 6.0389 6.0599 11.8532 6.0407 1.0674 1.0656 1.0635 1.0638 1.0985 1.0956 1.1011 1.1055 1.0847 1.0847 1.0883 1.0887 1.0935 1.0940 1.0966 1.0989 1.0992 1.0956 1.1593
irintensity: 0.4878 1.4663 0.0982 0.6981 0.5655 0.1683 0.6527 1.1398 0.7606 2.0299 0.0848 1.1506 4.1925 2.5000 0.2884 0.0496 0.3178 6.6650 8.4733 2.2662 6.9941 0.0048 0.2499 0.5318 5.0361 6.8125 6.9674 2.9835 7.1405 6.8737 9.2878 48.9858 12.0427 47.9075 1.7757 22.6430 31.7613 66.9266 24.9293 33.3733 38.2672 54.4273 8.6946 4.6286 1.1637 17.4956 116.9054 43.3485 17.1353 4.1839 3.5293 22.0108 80.8222 0.9194 0.7299 2.8752 1.0953 1.3010 0.2454 184.1144 21.6944 11.7637 9.7189 44.6718 2.9467 4.1658 16.2545 3.4430 27.3281 0.4359 0.0710 12.5594 15.7128 11.7028 5.7126 40.7984 28.3882 8.8362 2.9930 9.7584 1.8412 13.3285 99.2361 10.8296 306.3996 5.6585 0.5986 12.8447 11.5428 9.9228 17.0565 19.8368 11.0324 3.9753 7.1273 2.5983 0.4005 4.7432 0.5323 379.9138 1.5667 50.8470 27.7831 29.7944 30.1542 26.7304 10.9877 29.6655 60.2882 0.5462 0.4334 5.6002 7.6573 27.4362 30.6290 24.4046 29.5990 15.3264 8.7001 63.6835
temp: 298.150 k
press: 1.00000 atm
elementType: 8 8 7 6 6 6 6 6 6 6 6 6 6 6 6 6 6 6 6 6 6 6 6 1 1 1 1 1 1 1 1 1 1 1 1 1 1 1 1 1 1 1
symmnumber: 1
zpe: 879630.9 jmol-1
zpe.correction: 0.335034 hartree
zpe.thermalcorrener: 0.355933 hartree
zpe.thermalcorrenthalpy: 0.356878 hartree
zpe.thermalcorrgfe: 0.282978 hartree
zpe.sumelectzpe: -977.030760 hartree
zpe.sumelectthermal: -977.009860 hartree
zpe.sumelectthermalent: -977.008916 hartree
zpe.sumelectthermalfe: -977.082816 hartree
dipole: -1.5609 -1.7978 -1.9250
dipole: 3.0617
quadrupole: -114.8861 -125.3423 -127.7944
quadrupole: 7.0698 3.6161 -0.7647
quadrupole: 7.7882 -2.6680 -5.1202 7.0698 3.6161 -0.7647
hfenergy: -977.3657937 hartree
pointgroup: C01 [X(C20H19N1O2)]
dipole: -0.6098096 -0.6883416 -0.7780039 debye
polarizability: 220.3170369|4.3428793|238.9140358|-4.4136969|13.2014001|196.1485668 unknown
InChI: InChI=1S/C20H19NO2/c1-2-20(17-11-5-3-6-12-17,18-13-7-4-8-14-18)23-19(22)21-15-9-10-16-21/h1,3-8,11-14H,9-10,15-16H2
charge 0 multiplicity 1
42 atoms
O  -0.707355 -0.521427 0.185857
O  -1.787746 1.209433 1.412161
N  -2.977468 -0.307684 0.087101
C  -5.287585 -0.798463 -0.162211
C  -4.504967 -1.411537 -1.354292
C  -4.312289 0.259562 0.408031
C  -3.045643 -1.464446 -0.841075
C  -1.838106 0.223765 0.63308
C  0.658013 -0.038104 0.623443
C  0.914311 1.351396 0.00951
C  1.630443 -1.110482 0.066472
C  1.103601 2.504508 0.802863
C  2.998772 -0.784789 -0.100267
C  0.942109 1.465666 -1.40365
C  1.195018 -2.430714 -0.197366
C  0.755727 -0.06851 2.098763
C  1.331074 3.758253 0.192382
C  3.917747 -1.763469 -0.536178
C  1.158701 2.718483 -2.013498
C  2.11536 -3.407803 -0.639827
C  1.359286 3.870384 -1.215908
C  3.47965 -3.079915 -0.809961
C  0.899171 -0.165387 3.317189
H  -6.250674 -0.354144 -0.464141
H  -5.490918 -1.574788 0.598273
H  -4.878484 -2.40688 -1.648243
H  -4.57235 -0.745716 -2.234329
H  -4.437885 1.244429 -0.08291
H  -4.413649 0.41354 1.496012
H  -2.840811 -2.409286 -0.298863
H  -2.29549 -1.366947 -1.643555
H  1.052945 2.420597 1.892621
H  3.343953 0.234349 0.105089
H  0.795077 0.571169 -2.019528
H  0.139769 -2.681618 -0.06331
H  1.47447 4.647517 0.816205
H  4.97318 -1.497719 -0.662903
H  1.176099 2.797622 -3.10633
H  1.766381 -4.425842 -0.847347
H  1.532119 4.844095 -1.688371
H  4.192517 -3.839397 -1.150379
H  1.000528 -0.235201 4.384292
